*HEADING
 CORNER SUPPORTED TWO-WAY SLAB TESTED BY MCNEICE
*NODE
*NGEN,NSET=Y-SYM
*NGEN,NSET=X-SYM
*NGEN,NSET=LX2
*NGEN,NSET=LY2
*NSET,NSET=ONE
*NFILL
X-SYM,LY2,24,1
*ELEMENT,TYPE=S4R
*ELGEN,ELSET=SLAB
*SHELL SECTION,ELSET=SLAB,MATERIAL=CONC
 1.75,9
*REBAR,ELEMENT=SHELL,MATERIAL=SLABMT,GEOMETRY=ISOPARAMETRIC,NAME=YY
 SLAB,.014875,1.,-.435,4
*REBAR,ELEMENT=SHELL,MATERIAL=SLABMT,GEOMETRY=ISOPARAMETRIC,NAME=XX
 SLAB,.014875,1.,-.435,1
*MATERIAL,NAME=SLABMT
*ELASTIC
 29.E6,
*PLASTIC
 50.E3,
*DENSITY
7.3e-2,
*MATERIAL,NAME=CONC
*ELASTIC
 4.15E6,.15
*DENSITY
2.246e-2,
*BRITTLE CRACKING
*BRITTLE SHEAR
*BOUNDARY
 Y-SYM,YSYMM
 X-SYM,XSYMM
 2425,3
*AMPLITUDE,NAME=RAMP,DEFINITION=SMOOTH STEP
0.,0.,1.,1.
*RESTART,WRITE,NUM=1
*STEP
*DYNAMIC,EXPLICIT
,1
*BOUNDARY,AMP=RAMP
1,3,3,-1
*MONITOR,NODE=1,DOF=3
***OUTPUT,HISTORY,TIME INTERVAL=5.00E-4
***ENERGY OUTPUT
**ALLKE,ALLSE,ALLIE,ALLWK,ALLAE,ETOTAL
***NODE OUTPUT,NSET=ONE
**RF,
**U,
*****
*ELSET, ELSET=QA_TEST
*NSET, NSET=QA_TEST, ELSET=QA_TEST
*FILE OUTPUT,TIMEMARKS=YES,NUMBER=1
*NODEFILE, NSET=QA_TEST
U,
*ELFILE, ELSET=QA_TEST
CKEMAG,
CKSTAT,
CRACK,
*OUTPUT, FIELD, TIME MARKS=YES, NUMBER INTER=1
*ELEMENT OUTPUT, ELSET=QA_TEST
 LE,
*NODE OUTPUT, NSET=QA_TEST
 U,
*OUTPUT, HIST, FREQ=999
*ENERGY OUTPUT, VAR=PRESELECT
*****
*END STEP