*HEADING
 : CAP CREEP AND PLASTICITY, USER CREEP, TC, C3D8R, 3D
*RESTART,WRITE
*NODE,NSET=ALLN
*ELEMENT,TYPE=C3D8R,ELSET=ALLE
*SOLID SECTION,ELSET=ALLE,MATERIAL=ALLE
*MATERIAL,NAME=ALLE
*ELASTIC
 300.E4,.3
*CAP PLASTICITY
*CAP HARDENING
*CAP CREEP,LAW=USER,MECHANISM=CONSOLIDATION
*CAP CREEP,LAW=USER,MECHANISM=COHESION
*DEPVAR
*BOUNDARY
 1,PINNED
 2,2
 5,2
 6,2
 4,1
 5,1
 8,1
 2,3
 3,3
*AMPLITUDE,NAME=RAMP
 0.,0.,20.,1.5
**
*STEP,INC=30,UNSYM=YES
*VISCO ,CETOL=0.01
 2.,20.,,2.
*CONTROLS,PARAMETERS=FIELD,FIELD=DISPLACEMENT
 0.0001,
*CLOAD,AMPLITUDE=RAMP
 7,3,-10000.
 5,3,-10000.
 6,3,-10000.
 8,3,-10000.
 2,1,-4000.
 3,1,-4000.
 6,1,-4000.
 7,1,-4000.
*EL PRINT
 S,
 SINV,
 E,
 PE,
 PEQC,
 PEEQ,
 EE,
 CE,
*NODE PRINT
 U,
 RF,
*OUTPUT,FIELD,FREQ=1
*ELEMENT OUTPUT
S,E,PE,CE,CEEQ,CESW,SDV
*END STEP