*HEADING
 MCCSTMO3HUT: CAP CREEP AND PLASTICITY, STRAIN LAW, UT, C3D8, 3D
*RESTART,WRITE,FREQ=0
*NODE,NSET=ALLN
*ELEMENT,TYPE=C3D8,ELSET=ALLE
*SOLID SECTION,ELSET=ALLE,MATERIAL=ALLE
*MATERIAL,NAME=ALLE
*ELASTIC
 300.E4,.3
*CAP PLASTICITY
*CAP HARDENING
*CAP CREEP,LAW=STRAIN,MECHANISM=COHESION
*BOUNDARY
 1,PINNED
 2,2
 5,2
 6,2
 4,1
 5,1
 8,1
 2,3
 3,3
*AMPLITUDE,NAME=RAMP
 0.,0.,20.,1.0
*STEP,INC=50,NLGEOM,UNSYM=YES
*VISCO,CETOL=0.01
 1.,20.
*BOUNDARY,AMPLITUDE=RAMP
 7,3,,.2
 5,3,,.2
 6,3,,.2
 8,3,,.2
*EL PRINT,FREQ=0
 S,
 SINV,
 E,
 PE,
 EE,
 CE,
*NODE PRINT,FREQ=0
 U,
 RF,
*OUTPUT,FIELD,FREQ=2
*ELEMENT OUTPUT
S,E,EE,PE,CE
*ENERGY PRINT
*END STEP