*HEADING
 test Bergstrom-Boyce hysteresis in biaxial tension
 test short and long term hyperelasticity solutions.
*NODE,NSET=ALL
*ELEMENT,TYPE=CPE4,ELSET=ONE
*NSET,NSET=SIDE1
*NSET,NSET=SIDE2
*NSET,NSET=SIDE3
*NSET,NSET=SIDE4
*SOLID SECTION,ELSET=ONE,MATERIAL=ARRUDA
*MATERIAL,NAME=ARRUDA
*HYPERELASTIC,ARRUDA-BOYCE,MODULI=LONG TERM
1.71,2.8284,1.e-2
*hysteresis
*************************
**MULTIPLE LOAD CASES TEST
*************************
*STEP,PERTURBATION
*STATIC
*LOAD CASE,NAME="TENSION ON SIDE 2"
*BOUNDARY,OP=NEW
SIDE4,1
SIDE1,2
SIDE2,1,1,5.
*END LOAD CASE
*LOAD CASE,NAME="TENSION ON SIDE 3"
*BOUNDARY,OP=NEW
SIDE4,1
SIDE1,2
SIDE3,2,2,5.
*END LOAD CASE
*END STEP
*STEP,NLGEOM,INC=100,unsymm=yes
BIAXIAL TENSION
*STATIC
1.e-5,1.e-5
*BOUNDARY,OP=NEW
SIDE4,1
SIDE1,2
SIDE2,1,1,5.
SIDE3,2,2,5.
*EL PRINT,f=100
S,
LE,
MISES,
*NODE PRINT,f=100
U,RF
*OUTPUT,FIELD,FREQ=100
*ELEMENT OUTPUT
S,LE
*NODE OUTPUT
U,RF
*END STEP
**
*STEP,NLGEOM,INC=1000,unsymm=yes
 RELAXATION
*STATIC
100.,1.e13
*END STEP