*HEADING
1 X 4 mesh for cantilever bending problem with CPS6M elements.
**
*NODE
**
**
*ELEMENT, TYPE=CPS6M, ELSET=EALL
**
** eall
**
*SOLID SECTION, ELSET=EALL, MATERIAL=A1
         0.1,
**
** A1
** Date: 05-Apr-96           Time: 11:38:19
**
*MATERIAL, NAME=A1
**
*ELASTIC, TYPE=ISO
       1.E+7,       1.E-5
**
** step  1,Default
**
*STEP, AMPLITUDE=RAMP, PERTURBATION
Linear Static Analysis
**
This load case is the default load case that always appears
**
*STATIC
**
** fix
**
*BOUNDARY, OP=NEW
       1, 1,,          0.
       1, 2,,          0.
      10, 1,,          0.
      10, 2,,          0.
      19, 1,,          0.
      19, 2,,          0.
**
** load
**
*CLOAD, OP=NEW
       9, 2,        -0.5
      27, 2,        -0.5
**
*NODE FILE
U,
*OUTPUT,FIELD
*NODE OUTPUT
U,
*EL PRINT
S,
E,
*END STEP