*HEADING
 1D transient wave propagation, acoustic medium, incident wave
 load and incident wave reflection, spherical and defined through
 pressure amplitude
**
*PREPRINT,ECHO=NO,HISTORY=NO,MODEL=YES
*NODE,NSET=PLATE
*ELEMENT,TYPE=AC3D8,ELSET=ACOUSTIC
**************************
*SURFACE,NAME=IW_LOAD
1,S1
**************************
*SOLID SECTION,MATERIAL=AIR,ELSET=ACOUSTIC
**
*MATERIAL,NAME=AIR
*DENSITY
 1.21,
*ACOUSTIC MEDIUM,BULK MODULUS
**
**************************
*INCIDENT WAVE PROPERTY,NAME=IWPROP,TYPE=SPHERE
*INCIDENTWAVE FLUID PROPERTY
*AMPLITUDE,DEFINITION=TABULAR,NAME=PRESSUREVTIME
-1.0E-10,0.,0.,-1.,1.,-1.
**
**************************
*IMPEDANCE PROPERTY,NAME=IRPROP
**
**************************
*STEP,INC=1000
*DYNAMIC,ALPHA=0.0
0.00005,0.02
**
*IMPEDANCE
1,I2
*INCIDENTWAVE,PRESSUREAMPLITUDE=PRESSUREVTIME,PROPERTY=IWPROP
IW_LOAD,415.09517
**
*INCIDENT WAVE REFLECTION
5.,0.,1.,0.,IRPROP
**
*OUTPUT,FIELD,FREQ=1
*NODE OUTPUT
POR,
*OUTPUT,HISTORY,FREQ=1
*NODE OUTPUT,NSET=PLATE
POR,
**
*END STEP