*HEADING
 1D transient wave propagation, acoustic medium, incident wave
 load and incident wave reflection, spherical and defined through
 pressure amplitude
**
*PREPRINT,ECHO=NO,HISTORY=NO,MODEL=YES
*NODE,NSET=PLATE
*ELEMENT,TYPE=AC3D8R,ELSET=ACOUSTIC
**************************
*SURFACE,NAME=IW_LOAD
1,S1
**************************
*SOLID SECTION,MATERIAL=AIR,ELSET=ACOUSTIC
**
*MATERIAL,NAME=AIR
*DENSITY
 1.21,
*ACOUSTIC MEDIUM,BULK MODULUS
**
**************************
*INCIDENT WAVE PROPERTY,NAME=IWPROP,TYPE=SPHERE
*INCIDENTWAVE FLUID PROPERTY
*AMPLITUDE,DEFINITION=TABULAR,NAME=PRESSUREVTIME
0.,-1.,1.,-1.
**
**************************
*IMPEDANCE PROPERTY,NAME=IRPROP
**
**************************
*STEP
*DYNAMIC,EXPLICIT,DIRECT USER CONTROL
 0.00001,0.02
**
*IMPEDANCE
1,I2
*INCIDENTWAVE,PRESSUREAMPLITUDE=PRESSUREVTIME,PROPERTY=IWPROP
IW_LOAD,415.09517
**
*INCIDENT WAVE REFLECTION
5.,0.,1.,0.,IRPROP
**
*OUTPUT,FIELD,NUMBER INTERVAL=2
*NODE OUTPUT
POR,
*OUTPUT,HISTORY,TIME INTERVAL=0.1E-3
*NODE OUTPUT,NSET=PLATE
POR,
**
*END STEP