*HEADING
CONCENTRIC RINGS WITH INITIAL OVERCLOSURE [CPS4R]
TEST OF 2D FINITE SLIDING PENALTY CONTACT WITH TABULAR SOFTENED BEHAVIOR
*NODE, NSET=ODB_NSET
*NGEN,LINE=C,NSET=RAD_1
*NGEN,LINE=C,NSET=RAD_2
*NGEN,LINE=C,NSET=RAD_3
*NGEN,LINE=C,NSET=RAD_4
*NSET,NSET=INNER,GEN
*ELEMENT,TYPE=CPS4R
*ELGEN,ELSET=INELE
*ELGEN,ELSET=OUTELE
*ELSET,ELSET=INELE,GEN
*ELSET,ELSET=OUTELE,GEN
*SOLID SECTION, ELSET=INELE, MATERIAL=MAT_1
1.0,
*SOLID SECTION, ELSET=OUTELE, MATERIAL=STEEL
1.0,
*MATERIAL, NAME=STEEL
*DENSITY
8.0100E-06,
*ELASTIC, TYPE=ISO
206800.,.32
*MATERIAL, NAME=MAT_1
*DENSITY
8.0100E-06,
*ELASTIC,TYPE=ISOTROPIC
206800.,.32
*ELSET,ELSET=ODB_ESET
INELE, OUTELE
*NSET, NSET=ODB_NSET
ODB_NSET, RAD_1, RAD_2, RAD_3
RAD_4, INNER
*NSET,NSET=NODERES,ELSET=INELE
*NSET,NSET=NODERES,ELSET=OUTELE
*SURFACE,NAME=IN_SURF
INELE,S2
*SURFACE,NAME=OUT_SURF
OUTELE,S4
**
**
*STEP
*DYNAMIC,EXPLICIT
,1.0E-2
*BULK VISCOSITY
*CONTACT PAIR,INTERACTION=NOFRIC,MECHANICAL CONSTRAINT=PENALTY
OUT_SURF,IN_SURF
*SURFACE INTERACTION,NAME=NOFRIC,PAD THICKNESS=-9.80785E-02
*SURFACE BEHAVIOR,PRESSURE-OVERCLOSURE=TABULAR
0.0,-9.80785E-02
1.0E3,0.0
*BOUNDARY
INNER,1,2
52,2,2
60,2,2
**
** Output requests for postprocessing
**
*OUTPUT,FIELD,VAR=PRESELECT,NUM=2
**
** Output requests for qa testing
**
*NSET,NSET=QA_TESTN
*OUTPUT,FIELD,NUMBER=1
*NODE OUTPUT,NSET=QA_TESTN
U,
*OUTPUT,HISTORY,TIME INTERVAL=0.005
*ENERGY OUTPUT,VAR=PRESELECT
*END STEP