*Heading
Test of Surface generated by Cutting plane method
Verify integrated output (Explicit)
Elements Tested:CPS4R
*Part, name=Part-1
*End Part
**
**
** ASSEMBLY
**
*Assembly, name=Assembly
**
*Instance, name=Part-1-6, part=Part-1
*Node
*Element, type=CPS4R
** Region: (Section-1:Picked)
*Elset, elset=_PickedSet2, internal, generate
** Section: Section-1
*Solid Section, elset=_PickedSet2, material=steel
1.,
*End Instance
**
*Nset, nset=all, instance=Part-1-6, generate
*Elset, elset=all, instance=Part-1-6, generate
*Nset, nset=fix, instance=Part-1-6, generate
*Elset, elset=fix, instance=Part-1-6, generate
*Nset, nset=top, instance=Part-1-6, generate
*Elset, elset=top, instance=Part-1-6, generate
*SURFACE, TYPE=CUTTING SURFACE, NAME=PARALLEL_solid_POS
all
*SURFACE, TYPE=CUTTING SURFACE, NAME=angle_solid_pos
all
*SURFACE, TYPE=CUTTING SURFACE, NAME=PARALLEL_solid_neg
all
*SURFACE, TYPE=CUTTING SURFACE, NAME=angle_solid_neg
all
*******************
*node
*nset, nset=nref
*nset, nset=ioref
*nset, nset=ioref_move
*orientation, name=rect
*rigid body, ref node= nref, tie nset=all
*integrated output section, surf=PARALLEL_solid_POS,name=PARALLEL_solid_POS_sec, refnode = ioref
*integrated output section, surf=angle_solid_pos,name=angle_solid_pos_sec, refnode = ioref_move,position=center
*integrated output section, surf=PARALLEL_solid_neg,name=PARALLEL_solid_neg_sec, orient=rect
*integrated output section, surf=angle_solid_neg,name=angle_solid_neg_sec
*******************
*End Assembly
**
** MATERIALS
**
*Material, name=steel
*Elastic
 30e6, 0.33
*density
7800.
*expansion
1e-4
*INITIAL CONDITIONS,TYPE=STRESS
 all,30000.,60000.,0.,
** ----------------------------------------------------------------
**
** STEP: Step-1
**
*Step, name=Step-1
*dynamic,explicit
, 1.,
**
*****************
*AMPLITUDE,NAME=SMOOTH, DEFINITION=SMOOTH STEP
 0.,0.,1.,0.025
*BOUNDARY
nref,1,2
*BOUNDARY,TYPE=DISPLACEMENT,AMPLITUDE=SMOOTH
nref,6,6,6.28318531
**nref,6,6,62.8318531
*output, history,var=preselect,freq=1
**
*element output,elset=all
s,
*integrated output, surf=PARALLEL_solid_POS, var=all
*integrated output, surf=angle_solid_pos, var=all
*integrated output, surf=PARALLEL_solid_neg, var=all
*integrated output, surf=angle_solid_neg, var=all
*integrated output, sec=PARALLEL_solid_POS_sec, var=all
*integrated output, sec=angle_solid_pos_sec, var=all
*integrated output, sec=PARALLEL_solid_neg_sec, var=all
*integrated output, sec=angle_solid_neg_sec, var=all
*****************
*End Step