*Heading
Test of Surface generated by Cutting plane method
Test integrated output (Explicit)
Elements Tested: C3d8r
*Node
*Element, type=C3D8R
*Elset, elset=ALLC3D8, generate
***Section definition
*Solid Section, elset=ALLC3D8, material=steel
1.,
***
*Nset, nset=all, gen
*Nset, nset=DISP
*Nset, nset=FIXBOUN
*Material, name=steel
*Elastic
 2.1e+11, 0.3
*density
7800.
**pre print,model=yes
****Cut surface Definition
*SURFACE, TYPE=CUTTING SURFACE, NAME=test
allc3d8,
*SURFACE, TYPE=CUTTING SURFACE, NAME=PARALLEL_solid_POS
allC3D8,
*SURFACE, TYPE=CUTTING SURFACE, NAME=PARALLEL_solid_NEG
allC3D8,
**************
*SURFACE, TYPE=CUTTING SURFACE, NAME=angle_solid_pos
allC3D8,
*************
*SURFACE, TYPE=CUTTING SURFACE, NAME=angle_solid_neg
allC3D8,
*INITIAL CONDITIONS,TYPE=STRESS
allc3d8,30000.,60000.,90000.,
*******************
*node
*nset, nset=nref
*nset, nset=ioref
*nset, nset=ioref_move
*orientation, name=rect
*rigid body, ref node= nref, tie nset=all
*integrated output section, surf=PARALLEL_solid_POS,name=PARALLEL_solid_POS_sec, refnode = ioref
*integrated output section, surf=angle_solid_pos,name=angle_solid_pos_sec, refnode = ioref_move,position=center
*integrated output section, surf=PARALLEL_solid_neg,name=PARALLEL_solid_neg_sec, orient=rect
*integrated output section, surf=angle_solid_neg,name=angle_solid_neg_sec
*******************
** ------------------------------------------------------------
** STEP: Step-1
**
*Step, name=Step-1
*dynamic,explicit
, 1.,
**
*****************
*AMPLITUDE,NAME=SMOOTH, DEFINITION=SMOOTH STEP
 0.,0.,1.,0.025
*BOUNDARY
nref,1,5
*BOUNDARY,TYPE=DISPLACEMENT,AMPLITUDE=SMOOTH
nref,6,6,62.8318531
*output, history,var=preselect,freq=1
**
*element output,elset=allc3d8
s,
*integrated output, surf=PARALLEL_solid_POS, var=all
*integrated output, surf=angle_solid_pos, var=all
*integrated output, surf=PARALLEL_solid_neg, var=all
*integrated output, surf=angle_solid_neg, var=all
*integrated output, sec=PARALLEL_solid_POS_sec, var=all
*integrated output, sec=angle_solid_pos_sec, var=all
*integrated output, sec=PARALLEL_solid_neg_sec, var=all
*integrated output, sec=angle_solid_neg_sec, var=all
*****************
*End Step