*HEADING
 IMPORT ROLLING TIRE: AXISYMMETRIC MODEL
 UNITS: KG, M
*RESTART,WRITE,FREQ=100
*NODE,NSET=NTIRE,INP=tiretransfer_node.inp
*NODE,NSET=RIM
*ELEMENT,TYPE=CGAX4R,ELSET=TREAD
*ELEMENT,TYPE=CGAX4R,ELSET=SIDE
*ELEMENT,TYPE=CGAX4R,ELSET=BELT
*ELEMENT, TYPE=RAX2, ELSET=RIM
*ELSET,ELSET=CARCASS
SIDE,BELT
*ELEMENT,TYPE=SFMGAX1,ELSET=MEM_BELT1
*ELEMENT,TYPE=SFMGAX1,ELSET=MEM_BELT2
*ELEMENT,TYPE=SFMGAX1,ELSET=MEM_CARCASS
*EMBEDDED ELEMENT,HOST=CARCASS,ROUNDOFF TOL=1.e-3
MEM_CARCASS,
*EMBEDDED ELEMENT,HOST=BELT,ROUNDOFF TOL=1.e-3
MEM_BELT1,MEM_BELT2
*SURFACE SECTION,ELSET=MEM_BELT1
*REBAR LAYER
 BELT1, 0.2118683E-6, 1.16E-3, 0.0, BELT, 70.0
*SURFACE SECTION,ELSET=MEM_BELT2
*REBAR LAYER
 BELT2, 0.2118683E-6, 1.16E-3, 0.0, BELT, 110.0
*SURFACE SECTION,ELSET=MEM_CARCASS
*REBAR LAYER
 CARCASS, 0.4208352E-6, 1.00E-3, 0.0, CARCASS, 0.0
*SOLID SECTION,ELSET=TREAD,MATERIAL=RUBBER
*SOLID SECTION,ELSET=SIDE,MATERIAL=RUBBER
*SOLID SECTION,ELSET=BELT,MATERIAL=RUBBER
*RIGID BODY, ELSET=RIM, REFNODE=199, DENSITY=7800.
*MATERIAL,NAME=RUBBER
*HYPERELASTIC,N=1,MODULI=LONG TERM
 1.0e6, ,5.085e-8
*DENSITY
 1100.,
*MATERIAL,NAME=BELT
*ELASTIC,TYPE=ISO
 172.2E+09,0.3
*DENSITY
 5900.,
*MATERIAL,NAME=CARCASS
***ELASTIC,TYPE=LAMINA
*ELASTIC,TYPE=ISO
 9.87E+9, 0.3
*DENSITY
 1500.,
*NSET,NSET=RIMNOD
*NSET,NSET=SYM
*ELSET,ELSET=SOLID,GENERATE
*SURFACE,NAME=INSIDE
 BELT, S3
 SIDE, S3
***********************************
*STEP,NLGEOM=YES
 1:  INFLATION
*STATIC
 0.25, 1.0
*BOUNDARY
 RIM, 1, 2
 RIM, 5, 6
 RIMNOD, 5
 SYM, 2,
 SYM, 5,
*DSLOAD
 INSIDE, P, 200.E3
*OUTPUT,FIELD,VARIABLE=PRESELECT,FREQ=1
*OUTPUT,HISTORY,VARIABLE=PRESELECT,FREQ=1
*END STEP