*Heading
** Job name: Job-1 Model name: Model-1
*PREPRINT, MODEL=YES
**
** PARTS
**
*Part, name=Part-1
*End Part
**
** ASSEMBLY
**
*Assembly, name=Assembly
**
*Instance, name=Part-1-1, part=Part-1
*Node
*Element, type=SC8R
** Region: (Section-1:Picked)
*Elset, elset=_PickedSet2, internal, generate
** Section: Section-1
*Shell Section, elset=_PickedSet2, material=Material-1, Stack Direction=1
10.,
*End Instance
*Nset, nset=_PickedSet4, internal, instance=Part-1-1
*Elset, elset=_PickedSet4, internal, instance=Part-1-1
*Elset, elset=GB,  instance=Part-1-1
*Nset, nset=_PickedSet5, internal, instance=Part-1-1
*End Assembly
**
** MATERIALS
**
*Material, name=Material-1
*Elastic
100000., 0.3
** ----------------------------------------------------------------
**
** STEP: Step-1
**
*Step, name=Step-1
*Static
1.0, 1., 1e-05, 1.
**
** BOUNDARY CONDITIONS
**
** Name: BC-1 Type: Displacement/Rotation
*Boundary
_PickedSet4, 1, 1
_PickedSet4, 2, 2
_PickedSet4, 3, 3
**
** LOADS
**
** Name: Load-1   Type: Concentrated force
*Cload
_PickedSet5, 2, 20.
**
** OUTPUT REQUESTS
**
*Restart, write, frequency=1
**
** FIELD OUTPUT: F-Output-1
**
*Output, field, variable=PRESELECT
**
** HISTORY OUTPUT: H-Output-1
**
*Output, history, variable=PRESELECT
*El Print, freq=999999
s
*Node Print, freq=999999
u
*End Step