*HEADING
 TEST PRESSURE DEPENDENT GAP CONDUCTANCE (CPS4T)
 WITH FIELD FRICTION DEPENDENT
*NODE,NSET=BAR
*NODE,NSET=RB
*NSET,NSET=LEFT
*ELEMENT,TYPE=CPS4T,ELSET=ROD
*SOLID SECTION,ELSET=ROD,MATERIAL=A1
1.,
*MATERIAL,NAME=A1
*ELASTIC
1.E5,
*EXPANSION
1.E-5,
*CONDUCTIVITY
10.,
*DENSITY
1.,
*SPECIFIC HEAT
1.,
*NODE, NSET=WALL
*ELEMENT,ELSET=RIGID,TYPE=T2D2T
*SOLID SECTION,ELSET=RIGID,MATERIAL=A1
*RIGID BODY, REFNODE=9999,ELSET=RIGID,ISOTHERMAL=YES
*ELEMENT, TYPE=HEATCAP, ELSET=HCAP
*HEATCAP, ELSET=HCAP
*SURFACE,TYPE=ELEMENT,NAME=RIGHT
2,S2
*SURFACE,TYPE=ELEMENT,NAME=WALL
RIGID,SPOS
*CONTACT PAIR,INTERACTION=GAP
RIGHT,WALL
*SURFACE INTERACTION,NAME=GAP
*GAP CONDUCTANCE,PRESSURE
*FRICTION,DEPENDENCIES=1
0.0,,,,10.0
2.0,,,,30.0
*NSET,NSET=NALL
rb,bar,wall
*BOUNDARY
LEFT,1
WALL,1,2
WALL,6,6
*INITIAL CONDITIONS, TYPE=FIELD,VARIABLE=1
NALL,10
*RESTART, WRITE
*STEP
*COUPLED TEMPERATURE-DISPLACEMENT,STEADY STATE
0.25,1.0
*FIELD,variable=1
nall,20
*BOUNDARY
LEFT,11,11,200.
WALL,11,11,100.
*OUTPUT,FIELD,VARIABLE=PRESELECT,FREQ=999
*ELEMENT OUTPUT,ELSET=ROD
S,E
*OUTPUT, HISTORY,FREQ=1
*NODE OUTPUT, NSET=BAR
U,NT
*NODE OUTPUT,NSET=WALL
U,
*ENERGY OUTPUT,ELSET=ROD
ALLIE,ALLKE,ALLAE
*CONTACT PRINT
CSTRESS,
CFT
*EL PRINT
S
*END STEP