*HEADING
   SANDWICH PLATE:  PLATEMMA (1966)
GAUSS INTEGRATION WITH 5 SECTION POINTS PER LAYER
*RESTART, WRITE
*NODE
*NGEN,NSET=EDGE
*NGEN
*NSET,NSET=LEFT
*NSET,NSET=RIGHT
*ELEMENT,TYPE=S4R
*ELGEN,ELSET=PLATE
*SHELL SECTION,ELSET=PLATE,COMPOSITE, SECTION=GAUSS
0.04,5,FACE
0.5,5,CORE
0.04,5,FACE
*MATERIAL,NAME=CORE
*ELASTIC,TYPE=LAMINA
1.,1.,.25,0.5,1.0E4,1.0E4
*MATERIAL,NAME=FACE
*ELASTIC
1.0E7,0.0
*BOUNDARY
LEFT,1,6
*STEP
*STATIC
*CLOAD
 21 ,3,375.0
 221,3,375.0
*EL PRINT,POSITION=AVERAGED AT NODES
S,
TSHR,
*EL PRINT
 SF,
 SSAVG,
 SE,
*OUTPUT,FIELD
*ELEMENT OUTPUT
S,
TSHR,
*OUTPUT,FIELD
*ELEMENT OUTPUT
SF,
SSAVG,
SE,
*OUTPUT,FIELD
*NODE OUTPUT
U,
*NODE PRINT
U,
*END STEP