*HEADING
 : STRESS & SECT. FORCE FOR COMP. SHELLS W/ TRANSV SHEAR  [S8RT]
*RESTART,WRITE
*NODE
*NGEN,NSET=NALL
*NSET,NSET=SIDE1
*NSET,NSET=SIDE2
*NSET,NSET=SIDE3
*NSET,NSET=SIDE4
*ELEMENT,TYPE=S8RT,ELSET=EL
*SHELL SECTION,COMPOSITE,ELSET=EL
 .5, 3, LAMINA, ZERO
 .5, 3, LAMINA, PL90
 .5, 3, LAMINA, ZERO
*MATERIAL,NAME=LAMINA
*ELASTIC,TYPE=LAMINA
 25.E6, 1.E6, .25, 0.5E6, 0.5E6, 0.2E6
*CONDUCTIVITY
1.,
*DENSITY
 1.E-3,
*ORIENTATION,NAME=ZERO
*ORIENTATION,NAME=PL90
********************************************************************************
*STEP
** UNIAXIAL TENSION - 11
*COUPLED TEMPERATURE-DISPLACEMENT
 1.,1.
*BOUNDARY,OP=NEW
 NALL,11
 SIDE4,1,6
 SIDE1,2,6
 SIDE3,2,6
 SIDE2,2,6
*CLOAD,OP=NEW
 21,1, 3333.33
 22,1,13333.33
 23,1, 3333.33
*EL PRINT
 S,
 TSHR,
 E,
*EL PRINT
 SF,
 SE,
*OUTPUT,FIELD
*ELEMENT OUTPUT
S,
TSHR,
E,
*OUTPUT,FIELD
*ELEMENT OUTPUT
SF,
SE,
*END STEP
********************************************************************************
*STEP
** TRANSVERSE SHEAR - 13
*COUPLED TEMPERATURE-DISPLACEMENT
 1.,1.
*BOUNDARY,OP=NEW
 NALL,11
 SIDE4,1,6
 SIDE1,1,2
 SIDE1,4,6
 SIDE3,1,2
 SIDE3,4,6
 SIDE2,1,2
 SIDE2,4,6
*CLOAD,OP=NEW
 21,3, 3333.33
 22,3,13333.33
 23,3, 3333.33
*END STEP
********************************************************************************
*STEP
** MOMENT - 22
*COUPLED TEMPERATURE-DISPLACEMENT
 1.,1.
*BOUNDARY,OP=NEW
 NALL,11
 SIDE4,1,6
 SIDE1,1,2
 SIDE1,4
 SIDE1,6
 SIDE3,1,2
 SIDE3,4
 SIDE3,6
 SIDE2,1,2
 SIDE2,4
 SIDE2,6
*CLOAD,OP=NEW
 21,5, 3333.33
 22,5,13333.33
 23,5, 3333.33
*END STEP