*HEADING
EC38TCSI: CANTILEVER SANDWICH PLATE  [S8RT]
*NODE
*NGEN,NSET=EDGE
*NGEN
*NSET,NSET=LEFT
*NSET,NSET=RIGHT
*ELEMENT,TYPE=S8RT
*ELGEN,ELSET=PLATE
*SHELL SECTION,ELSET=PLATE,COMPOSITE
0.04,5,FACE
0.5,5,CORE
0.04,5,FACE
*MATERIAL,NAME=CORE
*ELASTIC,TYPE=LAMINA
1.E1,1.E1,.25,0.5E1,1.0E4,1.0E4
*CONDUCTIVITY
1.,
*DENSITY
 1.E-3,
*MATERIAL,NAME=FACE
*ELASTIC
1.0E7,0.0
*CONDUCTIVITY
1.,
*DENSITY
 1.E-3,
*BOUNDARY
LEFT,1,6
*STEP
*COUPLED TEMPERATURE-DISPLACEMENT
 1,1
*CLOAD
 21 ,3,125.0
 121,3,500.0
 221,3,125.0
*EL PRINT,POSITION=AVERAGED AT NODES
S,
TSHR,
*EL PRINT
 SF,
 SE,
*OUTPUT,FIELD
*ELEMENT OUTPUT
S,
TSHR,
*OUTPUT,FIELD
*ELEMENT OUTPUT
SF,SE
*OUTPUT,FIELD
*NODE OUTPUT
U,
*NODE PRINT
U,
*END STEP