*heading
 MATERIAL COMBINATIONS:
   MAT1: EOS+EOS COMPACTION
   MAT2: EOS+EOS COMPACTION+EOS SHEAR (VISCOUS);
   MAT3: EOS+EOS COMPACTION+EOS SHEAR (ELASTIC);
   MAT4: EOS+EOS COMPACTION+EOS SHEAR+MISES;
   MAT5: EOS+EOS COMPACTION+EOS SHEAR+JOHNSON COOK.
 LOADING: UNAXIAL
*preprint, model=yes
*part, name=part-1
*node,nset=a1
*node,nset=a2
*node,nset=a3
*node,nset=a4
*node,nset=a5
**
**  3d solid element
*element, type=c3d8r, elset=c3d1
*element, type=c3d8r, elset=c3d2
*element, type=c3d8r, elset=c3d3
*element, type=c3d8r, elset=c3d4
*element, type=c3d8r, elset=c3d5
**
**  plane strain element
*element, type=cpe4r, elset=pe2d1
*element, type=cpe4r, elset=pe2d2
*element, type=cpe4r, elset=pe2d3
*element, type=cpe4r, elset=pe2d4
*element, type=cpe4r, elset=pe2d5
**
*solid section,elset=c3d1,material=mat1
*solid section,elset=pe2d1,material=mat1
**
*solid section,elset=c3d2,material=mat2
*solid section,elset=pe2d2,material=mat2
**
*solid section,elset=c3d3,material=mat3
*solid section,elset=pe2d3,material=mat3
**
*solid section,elset=c3d4,material=mat4
*solid section,elset=pe2d4,material=mat4
**
*solid section,elset=c3d5,material=mat5
*solid section,elset=pe2d5,material=mat5
**
*nset,nset=bot
*nset,nset=left
*nset,nset=top
*nset,nset=face,generate
*elset,elset=eall,generate
*elset,elset=qa_test
 eall,
*end part
**
*assembly, name=assembly-1
*instance, name=part-1-1, part=part-1
*end instance
*end assembly
**
*material,name=mat1
*density
 2070,
*eos, type=usup
*eos compaction
**
*material,name=mat2
*density
 2070,
*eos, type=usup
*eos compaction
*eos shear,type=viscous
**
*material,name=mat3
*density
 2070,
*eos, type=usup
*eos compaction
*eos shear,type=elastic
**
*material,name=mat4
*density
 2070,
*eos, type=usup
*eos compaction
*eos shear,type=elastic
*plastic,hardening=isotropic
 1.970E+06, 0.000
 2.701E+06, 0.004
 2.882E+06, 0.008
 3.009E+06, 0.012
 3.109E+06, 0.016
 3.193E+06, 0.020
 3.348E+06, 0.029
 3.472E+06, 0.038
**
*material,name=mat5
*density
 2070,
*eos, type=usup
*eos compaction
*eos shear,type=elastic
*plastic,hardening=johnson cook
 1.97e6, 4.28e6, 0.32, 0.55, 1538., 25.
**
*boundary
 assembly-1.part-1-1.left, 1, 1
 assembly-1.part-1-1.bot,  2, 2
 assembly-1.part-1-1.face, 3, 3
**
*restart,timemarks=no,write,number=10
**
*step
*dynamic,explicit
 ,1.0
** unaxial tension
*boundary, type=velocity
 assembly-1.part-1-1.top, 2, 2, -0.1
**
*output,field
*element output,elset=assembly-1.part-1-1.qa_test
 s, peeq, palph, palphmin
*node output
 u
*output,history
*element output,elset=assembly-1.part-1-1.qa_test
 s22, peeq, palph, palphmin
*energy output, var=preselect
**
*end step