*HEADING
: SURFACE-BASED PRESSURE PENETRATION TEST
WITH RIGID SURFACE, CAX8
*RESTART,WRITE, FREQ=1
*NODE
*NSET,NSET=PRINT
*NSET,NSET=NALL
*ELEMENT,TYPE=CAX8,ELSET=BOT
*ELEMENT,TYPE=MAX1,ELSET=TOP
*NSET,NSET=TOP
*MEMBRANE SECTION,ELSET=TOP,MATERIAL=MAT
1
*RIGID BODY,ELSET=TOP,REF NODE=100
*SOLID SECTION,ELSET=BOT,MATERIAL=MAT
*MATERIAL,NAME=MAT
*ELASTIC
1.E5,0.3
*DENSITY
1.0E-3,
*surface,NAME=TOPS
TOP,SPOS
*surface,NAME=BOTS
1,S1
2,S2
3,S4
4,S2
5,S3
6,S3
7,S1
8,S1
*SURFACE INTERACTION,NAME=ISLS
1.0,
*SURFACE BEHAVIOR, AUGMENTED
*FRICTION
0.,
*CONTACT PAIR,INTERACTION=ISLS, SMALL SLIDING
BOTS,TOPS
*BOUNDARY
100,1,2
100,6,6
NALL,2,2
*STEP,INC=20
*STATIC
0.1,1
*BOUNDARY
10,1,1,-3.75E-3
48,1,1,-4.437E-3
11,1,1,-5.25E-3
49,1,1,-6.212E-3
12,1,1,-7.35E-3
50,1,1,-8.696E-3
13,1,1,-10.29E-3
51,1,1,-12.17E-3
*OUTPUT,FIELD
*CONTACT OUTPUT,VARIABLE=PRESELECT,SLAVE=BOTS,MASTER=TOPS
CSTRESS,
*CONTACT PRINT,SLAVE=BOTS,MASTER=TOPS
CSTRESS,
*NODE PRINT,NSET=PRINT
RF
*ENDSTEP
*STEP, INC=20
*STATIC
0.01,1
*PRESSURE PENETRATION,SLAVE=BOTS,MASTER=TOPS
*CONTACT PRINT,SLAVE=BOTS,MASTER=TOPS,TOTAL=YES,FREQ=1
CSTRESS,PPRESS,CDISP
*OUTPUT,FIELD,FREQ=1
*CONTACT OUTPUT,VARIABLE=PRESELECT,SLAVE=BOTS,MASTER=TOPS
CSTRESS,PPRESS,CDISP
*PRINT,CONTACT=YES
*ENDSTEP
*STEP, INC=20
*STATIC
0.01,1
*PRESSURE PENETRATION,SLAVE=BOTS,MASTER=TOPS
*CONTACT PRINT,SLAVE=BOTS,MASTER=TOPS,TOTAL=YES,FREQ=1
CSTRESS,PPRESS,CDISP
*OUTPUT,FIELD,FREQ=1
*CONTACT OUTPUT,VARIABLE=PRESELECT,SLAVE=BOTS,MASTER=TOPS
CSTRESS,PPRESS,CDISP
*PRINT,CONTACT=YES
*ENDSTEP