*HEADING
EIA2TSCC: PORE PRESSURE COUPLED CONTACT  (CAX4P) (NO SLIDING)
*RESTART, WRITE, F=2
*NODE,NSET=ALL
*NGEN,NSET=ALL
*NSET,NSET=BOT
*NSET,NSET=TOP
**
*ELEMENT,TYPE=CAX4P,ELSET=ACTIVE
*SOLID SECTION,ELSET=ACTIVE,MATERIAL=ACTIVE
*MATERIAL,NAME=ACTIVE
*ELASTIC
30.E6,
*PERMEABILITY
 1.E-4,
**
*surface,NAME=MAS
2,S3
*surface,NAME=SLA
101,S1
*CONTACT PAIR,INTERACTION=ISLS
SLA, MAS
*SURFACE INTERACTION,NAME=ISLS
1.0,
**
*INITIAL CONDITIONS,TYPE=RATIO
ALL, 1.0
**
*STEP,INC=50,NLGEOM,AMP=STEP,UNSYMM=YES
Step 1
*SOIL, CONSOLIDATION
*BOUNDARY
BOT,1,2
TOP,2,2
BOT,8,8,2
TOP,8,8,1
*DLOAD
101,P3,10.
*CONTACT PRINT,F=10
PFL,PFLA,PTL,PTLA
TPFL,TPTL
**
*OUTPUT,FIELD,FREQ=10
*CONTACT OUTPUT
PFL,PFLA,PTL,PTLA
*NODE PRINT,F=10
POR,
*OUTPUT,FIELD,FREQ=10
*NODE OUTPUT
POR,
*EL PRINT, F=0
*END STEP
**