*Heading
** Job name: staticblocks Model name: Model-1
*restart,write
**
** PARTS
**
*Part, name=BottomBlock
*End Part
*Part, name=TopBlock
*End Part
**
** ASSEMBLY
**
*Assembly, name=Assembly
**
*Instance, name=BottomBlock-1, part=BottomBlock
*node
*Nset, nset=BOTTOM
*MPC
BEAM,BOTTOM,1001
*Node
*Element, type=C3D10MP
** Region: (SOLID:Picked)
*Elset, elset=_I1, internal, generate
** Section: SOLID
*Solid Section, elset=_I1, material=SOLMAT
1.,
*End Instance
**
*Instance, name=TopBlock-1, part=TopBlock
*Node
*Element, type=C3D10MP
** Region: (SOLID:Picked)
*Elset, elset=_I1, internal, generate
** Section: SOLID
*Solid Section, elset=_I1, material=SOLMAT
1.,
*End Instance
*Nset, nset=TOP, instance=TopBlock-1
*Elset, elset=TOP, instance=TopBlock-1
*Nset, nset=BOTTOM, instance=BottomBlock-1
*nset,nset=handle, instance=BottomBlock-1
*Elset, elset=BOTTOM, instance=BottomBlock-1
*Nset, nset=NALL, instance=BottomBlock-1, generate
*Nset, nset=NALL, instance=TopBlock-1, generate
*Elset, elset=NALL, instance=BottomBlock-1, generate
*Elset, elset=NALL, instance=TopBlock-1, generate
*Elset, elset=_ASURF_S3, internal, instance=BottomBlock-1
*Elset, elset=_ASURF_S2, internal, instance=BottomBlock-1
*Elset, elset=_ASURF_S1, internal, instance=BottomBlock-1
*Surface, type=ELEMENT, name=ASURF
_ASURF_S3, S3
_ASURF_S2, S2
_ASURF_S1, S1
*Elset, elset=_BSURF_S2, internal, instance=TopBlock-1
*Elset, elset=_BSURF_S3, internal, instance=TopBlock-1
*Elset, elset=_BSURF_S4, internal, instance=TopBlock-1
*Elset, elset=_BSURF_S1, internal, instance=TopBlock-1
*Surface, type=ELEMENT, name=BSURF
_BSURF_S2, S2
_BSURF_S3, S3
_BSURF_S4, S4
_BSURF_S1, S1
*Elset, elset=__G11_S3, internal, instance=TopBlock-1
*Elset, elset=__G11_S2, internal, instance=TopBlock-1
*Elset, elset=__G11_S1, internal, instance=TopBlock-1
*Surface, type=ELEMENT, name=_G11, internal
__G11_S3, S3
__G11_S2, S2
__G11_S1, S1
*End Assembly
**
** MATERIALS
**
*Material, name=SOLMAT
*Elastic
 3e+07,0.
*PERMEABILITY
 1.E-1,
**
** INTERACTION PROPERTIES
**
*Surface Interaction, name=GAP
1.,
**
** INTERACTIONS
**
** Interaction: GAP
*Contact Pair, interaction=GAP
BSURF, ASURF
** ----------------------------------------------------------------
**
*INITIAL CONDITIONS,TYPE=RATIO
NALL,1.
**
** STEP: Step-1
**
*Step, name=Step-1
*soils, consolidation
**
** BOUNDARY CONDITIONS
**
** Name: BC-1 Type: Displacement/Rotation
*Boundary
NALL, 1, 1
NALL, 3, 3
** Name: BC-2 Type: Displacement/Rotation
*Boundary
TOP, 1, 1
TOP, 3, 3
** Name: BC-3 Type: Displacement/Rotation
*Boundary
handle,1,6
**
BOTTOM,8,8,1
TOP,8,8,2
**
** LOADS
**
** Name: Pressure   Type: Pressure
*Dsload
_G11, P, 10.
**
** OUTPUT REQUESTS
**
*CONTACT PRINT,F=10
PFL,PFLA,PTL,PTLA
TPFL,TPTL
**
*CONTACT FILE,F=10
CAREA,
PFL, PFLA, PTL, PTLA
TPFL,TPTL
*NODE PRINT,F=10
POR,
*NODE FILE,F=10
POR,
*EL PRINT, F=0
*End Step