*HEADING
SIMPLE CONTACT TEST, COUPLED TEMPERATURE-DISPLACEMENT []
*RESTART,WRITE
*NODE
*NSET,NSET=BOTTOM
*NSET,NSET=TOP
*NSET,NSET=BACK
*ELEMENT, TYPE=C3D8HT, ELSET=SOLID
*SOLID SECTION, ELSET=SOLID, MATERIAL=SOLMAT
*MATERIAL, NAME=SOLMAT
*ELASTIC
30.E6,0.3
*EXPANSION
10.E-6,
*CONDUCTIVITY
43.0,
*DENSITY
7700.,
*SPECIFIC HEAT
600.,
*SURFACE INTERACTION, NAME=GAP
1.0,
*FRICTION
0.01,
*GAP CONDUCTANCE
*GAP RADIATION
** converted from old data: 1.E-9, 1.E-9
*GAP HEAT GENERATION
**
*PHYSICAL CONSTANTS, ABSOLUTE ZERO=-273.16,STEFANB=5.6697E-8
**
*** nset definitions for prescribing temperatures.
**
*NSET, NSET=NELEM1
*NSET, NSET=NELEM23
**
** surfaces
**
*surface, NAME=ASURF
4, S5
*surface, NAME=BSURF
2, S4
3, S4
*CONTACT PAIR, SMALL SLIDING, INTERACTION=GAP, TYPE=SURFACE TO SURFACE
BSURF, ASURF
*surface, NAME=ATIED
2, S6
3, S6
*surface, NAME=BTIED
1, S3
*TIE,NAME=TIE,POSITION TOLERANCE=0.01
ATIED, BTIED
**
*** Apply different temperatures to the nodes above and
*** below the contact surface
**
*STEP
*COUPLED TEMPERATURE-DISPLACEMENT,STEADY STATE
*ENERGY FILE
*EL FILE
S,
E,
EE,
TEMP,
*NODE FILE
RF,
NT,RFL
*ENERGY PRINT
*EL PRINT ,SUM=NO
S,
E,
EE,
TEMP,
*NODE PRINT,SUM=NO
RF,
NT,RFL
U,
*BOUNDARY
BACK,3,3
BOTTOM,2,2
TOP,2,2
3, 1, 1
7, 1, 1
25,1, 1
29,1, 1
NELEM1, 11, 11, 700.0
NELEM23, 11, 11, 500.0
*CONTACT CONTROLS, FRICTION ONSET=DELAYED
*CONTACT PRINT
CSTRESS,CDISP
HFL,HFLA,HTL
SFDR,SFDRA
*CONTACT FILE
CSTRESS,CDISP
HFL,HFLA,HTL
SFDR,SFDRA
*END STEP
**
**** STEP 2. Push top block to the right.
**
*STEP, NLGEOM ,INC=10
*COUPLED TEMPERATURE-DISPLACEMENT,STEADY STATE
0.1,1.0,0.1,0.1
*BOUNDARY, OP=NEW
BACK,3,3
3, 1, 1, 0.01
7, 1, 1, 0.01
10, 1, 1, 0.01
14, 1, 1, 0.01
1, 1, 1, 0.01
5, 1, 1, 0.01
NELEM1, 11, 11, 700
NELEM23, 11, 11, 500
TOP, 2, 2
BOTTOM, 2, 2
27, 1, 1
31, 1, 1
*EL FILE
S,
E,
*NODE FILE
RF,
NT,RFL,
*CONTACT PRINT
CSTRESS,CDISP
HFL,HFLA,HTL,
SFDR,SFDRA,
*CONTACT FILE
CSTRESS,CDISP
HFL,HFLA,HTL
SFDR,SFDRA
*END STEP
**
*** STEP 3. Push top block back into position.
**
*STEP, NLGEOM, INC=10
*COUPLED TEMPERATURE-DISPLACEMENT,STEADY STATE
0.1,1.0,0.1,0.1
*BOUNDARY, OP=NEW
BACK,3,3
3, 1, 1,
7, 1, 1,
10, 1, 1,
14, 1, 1,
1, 1, 1,
5, 1, 1,
NELEM1, 11, 11, 700
NELEM23, 11, 11, 500
TOP, 2, 2
BOTTOM, 2, 2
27, 1, 1
31, 1, 1
*EL FILE
S,
E,
*NODE FILE
RF,
NT, RFL,
*CONTACT PRINT
CSTRESS,CDISP
HFL,HFLA,HTL,
SFDR,SFDRA,
*CONTACT FILE
CSTRESS,CDISP
HFL,HFLA,HTL
SFDR,SFDRA
*END STEP
**
**** test for linear perturbation
***
*STEP,NLGEOM,PERTURBATION
*STATIC
*BOUNDARY,OP=NEW
BACK,3,3
BOTTOM,2,2
TOP ,2,2 , 0.05
3, 1, 1
7, 1, 1
25,1, 1
29,1, 1
*ENERGY FILE
*EL FILE
S,
E,
*NODE FILE
RF,
*ENERGY PRINT
*EL PRINT ,SUM=NO
S,
E,
TEMP,
*NODE PRINT,SUM=NO
RF,
NT,
*CONTACT PRINT
*CONTACT FILE
*END STEP