*HEADING
EI23PFSS_CPE6MP: PORE PRESSURE COUPLED CONTACT (CPE6MP) (FINITE SLIDING)
*RESTART,WRITE,F=2
*NODE,NSET=ALL
*NGEN,NSET=ALL
*NSET,NSET=BOT,GEN
*NSET,NSET=TOP,GEN
**
*ELEMENT,TYPE=CPE6MP,ELSET=DEAD
*SOLID SECTION,ELSET=DEAD,MATERIAL=DEAD
*MATERIAL,NAME=DEAD
*ELASTIC
30.E6,
*PERMEABILITY
 1.E-4,
**
*ELEMENT,TYPE=CPE6MP,ELSET=ACTIVE
*SOLID SECTION,ELSET=ACTIVE,MATERIAL=ACTIVE
*MATERIAL,NAME=ACTIVE
*ELASTIC
30.E6,
*PERMEABILITY
 1.E-4,
**
*surface,NAME=MAS
102,S2
202,S2
302,S2
**1,S3
**2,S3
**3,S3
*surface,NAME=SLA
401,S1
501,S1
*CONTACT PAIR,INTERACTION=ISLS
SLA, MAS
*SURFACE INTERACTION,NAME=ISLS
1.0,
**
*INITIAL CONDITIONS,TYPE=RATIO
ALL, 1.0
*INITIAL CONDITIONS,TYPE=PORE PRESSURE
ALL, 100.0
**
*STEP,INC=50,NLGEOM,AMP=STEP,UNSYMM=YES
Step 1
*SOIL, CONSOLIDATION
*BOUNDARY
BOT,2,2
1,1,1
7,1,1
113,1,2
4,8,,100.
**
*DLOAD
402,P2,100.
502,P2,100.
*DFLOW
402,S2,3.e-4
502,S2,3.e-4
101,S1,-1.e-4
201,S1,-1.e-4
301,S1,-1.e-4
**
*OUTPUT,FIELD
*NODE OUTPUT
POR,
*ELEMENT OUTPUT
FLVEL,
*EL PRINT,F=100
S,E
*PRINT,CONTACT=YES
*CONTACT PRINT
CAREA, TPFL
*CONTACT FILE
CAREA, TPFL
*END STEP
**
*STEP,INC=50,NLGEOM,AMP=RAMP,UNSYMM=YES
Step 2
*SOIL, CONSOLIDATION
*BOUNDARY,FIXED
TOP,2,2
*BOUNDARY
113, 1,1, 1.5
4,8,8,100.
*CONTACT PRINT
CAREA, TPFL
*CONTACT FILE
CAREA, TPFL
*END STEP