*HEADING
EI23PFSN_CPE6MP: PORE PRESSURE COUPLED CONTACT (CPE6MP) (NO SLIDING)
*restart, write,F=2
*NODE,NSET=NALL
**
*ELEMENT,TYPE=CPE6MP,ELSET=BOT
**11,101,102,103,104,201,202,203,204
*ELEMENT,TYPE=CPE6MP,ELSET=UP
**21,105,106,107,108,205,206,207,208
*ELSET,ELSET=EALL
BOT,UP
*SOLID SECTION,ELSET=EALL,MATERIAL=MAT
*MATERIAL,NAME=MAT
*ELASTIC
30.E6,0.0
*PERMEABILITY
 1.E-4,
*surface,NAME=MAS
12,S2
**BOT,S3
*surface,NAME=SLA
21,S1
**UP,S1
*SURFACE INTERACTION,NAME=ISLS
1.,
*CONTACT PAIR,INTERACTION=ISLS
SLA, MAS
*BOUNDARY
101,1,2
201,2,2
102,2,2
207,1,1
*INITIAL CONDITIONS,TYPE=RATIO
NALL,1.
*STEP
*SOILS, CONSOLIDATION
*BOUNDARY
101,8,8,1
102,8,8,1
201,8,8,1
107,8,8,2
207,8,8,2
108,8,8,2
*DLOAD
22,P2,10
*CONTACT PRINT,F=10
PFL,PFLA,PTL,PTLA
TPFL,TPTL
**
*OUTPUT,FIELD
*NODE OUTPUT
U,POR,
*ELEMENT OUTPUT
S,
*CONTACT OUTPUT
PFL, PFLA, PTL, PTLA
*CONTACT FILE,F=10
CAREA,
PFL, PFLA, PTL, PTLA
TPFL,TPTL
*NODE PRINT,F=10
POR,
*NODE FILE,F=10
POR,
*EL PRINT, F=0
*ENDSTEP