*HEADING
EI23PFSS: PORE PRESSURE COUPLED CONTACT (CPE8P) (NO SLIDING)
*restart, write,F=2
*NODE,NSET=NALL
**
*ELEMENT,TYPE=CPE8P,ELSET=BOT
*ELEMENT,TYPE=CPE8P,ELSET=UP
*ELSET,ELSET=EALL
BOT,UP
*SOLID SECTION,ELSET=EALL,MATERIAL=MAT
*MATERIAL,NAME=MAT
*ELASTIC
30.E6,0.0
*PERMEABILITY
 1.E-4,
*surface,NAME=MAS
BOT,S3
*surface,NAME=SLA
UP,S1
*SURFACE INTERACTION,NAME=ISLS
1.,
*CONTACT PAIR,INTERACTION=ISLS
SLA, MAS
*BOUNDARY
101,1,2
201,1,2
102,1,2
108,1,1
*INITIAL CONDITIONS,TYPE=RATIO
NALL,1.
*STEP
*SOILS, CONSOLIDATION
*BOUNDARY
101,8,8,1
102,8,8,1
107,8,8,2
108,8,8,2
*DLOAD
UP,P3,10
*CONTACT PRINT,F=10
PFL,PFLA,PTL,PTLA
TPFL,TPTL
**
*CONTACT FILE,F=10
CAREA,
PFL, PFLA, PTL, PTLA
TPFL,TPTL
*NODE PRINT,F=10
POR,
*NODE FILE,F=10
POR,
*EL PRINT, F=0
*ENDSTEP