*HEADING
: CREEP AND PLASTICITY TEST WITH CRUSHING FOR GASKET ELEMENT [GKPE4]
*****
Notes:
1)  -- original file; tests elastic-plastic-creep via *GASKET BEHAVIOR
2) Added gasket element (#11) with gasket behavior specified via *MATERIAL
3) Added equivalent solid elem CPE4 (#21) for result comparison (with Elem-11)
*****
*RESTART,WRITE,FREQ=999
*NODE,NSET=NALL
**-----------------------------------------
*ELEMENT,TYPE=GKPE4,ELSET=EINT
*GASKET SECTION,ELSET=EINT,BEHAVIOR=IS1
*GASKET BEHAVIOR,NAME=IS1
*GASKET THICKNESS BEHAVIOR,DIRECTION=LOADING
*CREEP,LAW=TIME
2.5E-27,5,-0.2
**-----------------------------------------
*ELEMENT,TYPE=GKPE4,ELSET=EINT2
*GASKET SECTION,ELSET=EINT2,MATERIAL=IS2
*MATERIAL,NAME=IS2
*ELASTIC
2.E7,
*PLASTIC
20000.,0.
22000.,.001
24000.,.002
*CREEP,LAW=TIME
2.5E-27,5,-0.2
**-----------------------------------------
*ELEMENT,TYPE=CPE4,ELSET=EINT3
*SOLID SECTION,ELSET=EINT3,MATERIAL=IS2
**-----------------------------------------
*AMPLITUDE,NAME=RAM
0.,21000.,40000.,24000.
*BOUNDARY
1,1,2
2,2,2
3,1
11,1,2
12,2,2
13,1
21,1,2
22,2,2
*STEP,INC=20
*STATIC
1.,1.
*CLOAD
3,2,-21000.
4,2,-21000.
13,2,-21000.
14,2,-21000.
23,2,-21000.
24,2,-21000.
*EL PRINT,F=18
S,
E,
CE,
EE,
NE,
PE,
EVOL,
*ENERGY PRINT,F=0
ETOTAL,
*EL FILE,F=18
S,
E,
EE,
NE,
PE,
CE,
*ENERGY FILE,F=18
ETOTAL,
*NODE FILE,F=18
U,
RF,
*NODE PRINT,F=0
U,
RF,
*OUTPUT, FIELD, FREQ=18
*ELEMENT OUTPUT
S,
E,
EE,
NE,
PE,
CE,
*NODE OUTPUT
U,
RF,
*OUTPUT, HISTORY, FREQ=18
*ENERGY OUTPUT
ETOTAL,
*END STEP
*STEP,INC=10000
*VISCO,CETOL=5.E-6
0.01,40000.,1.E-8
*CONTROLS,PARAMETERS=FIELD
5.E-6,1.E-4
*CLOAD,AMP=RAM
3,2,-1.0
4,2,-1.0
13,2,-1.0
14,2,-1.0
23,2,-1.0
24,2,-1.0
*PRINT,PLASTICITY=YES
*END STEP