*HEADING
: BENDING OF CYLINDER DUE TO ASYMMETRIC PORE PRESSURE FIELD  [CAXA8RP2]
** 6-IN LONG CYLINDER OF 2-IN & 6-IN INNER AND OUTER RADII (2X1 MESH)
*NODE
*NGEN,NSET=BOT1
*NGEN,NSET=TOP1
*NFILL,NSET=P001
BOT1,TOP1,2,10
*ELEMENT,TYPE=CAXA8RP2,OFFSET=1200,ELSET=ALL
*ELGEN,ELSET=ALL
*SOLID SECTION,ELSET=ALL,MATERIAL=MATPROP
*MATERIAL,NAME=MATPROP
*ELASTIC
 1.E8,0.3
*PERMEABILITY
 1.E-5, 1.
*INITIAL CONDITIONS,TYPE=RATIO
NALL,1.
*NSET,NSET=NALL,GEN
*NSET,NSET=BOTTOM,GEN
*NSET,NSET=L1-000
*NSET,NSET=L1-090
*NSET,NSET=L1-180
*NSET,NSET=L3-000
*NSET,NSET=L3-090
*NSET,NSET=L3-180
*NSET,NSET=L1
L1-000,L1-090,L1-180
*NSET,NSET=L3
L3-000,L3-090,L3-180
*NSET,NSET=NFILE
NALL,
*ELSET,ELSET=EFILE
*BOUNDARY
1,1
BOTTOM,2,2
*RESTART,WRITE,FREQ=999
*STEP
*SOILS
*BOUNDARY
L1-000,8,,1.E6
L1-090,8,,0.0
L1-180,8,,-1.E6
L3-000,8,,3.E6
L3-090,8,,0.0
L3-180,8,,-3.E6
*EL PRINT,ELSET=EFILE
S,
*EL PRINT,ELSET=EFILE,POSITION=AVERAGED AT NODES
S,
E,
*NODE PRINT,NSET=NALL,TOTAL=NO
U,POR,RVT,RF
** *NODE PRINT,NSET=L1,TOTAL=NO
** COORD,U,POR,RVT,RF
** *NODE PRINT,NSET=L5,TOTAL=NO
** COORD,U,POR,RVT,RF
** *NODE PRINT,NSET=L9,TOTAL=NO
** COORD,U,POR,RVT,RF
*EL FILE,ELSET=EFILE,POSITION=AVERAGED AT NODES
E,
*NODE FILE,NSET=NFILE
U,POR,RVT,RF
*OUTPUT,FIELD
*NODE OUTPUT,NSET=NFILE
U,POR,RVT
*END STEP