*HEADING
: 2-POINT BENDING OF A PIPE DUE TO SELF WEIGHT  [CAXA8RP2]
*NODE
*NGEN,NSET=PLANE1
*NSET,NSET=BOT,GEN
*NSET,NSET=TOP,GEN
*ELEMENT,TYPE=CAXA8RP2,OFFSET=1200, ELSET=EALL
*ELGEN,ELSET=EALL
*SOLID SECTION,MATERIAL=MAT, ELSET=EALL
*MATERIAL,NAME=MAT
*ELASTIC
 2.0684E11,0.3
*PERMEABILITY
1.E-15,
*INITIAL CONDITIONS,TYPE=RATIO
NALL,1.
*NSET,NSET=NALL,GEN
*ELSET,ELSET=EPRINT
*NSET,NSET=NPRINT
TOP,BOT,105
*BOUNDARY
 BOT,2
 105,1
*STEP,PERTURBATION
*STATIC
*DLOAD
 EALL,BX,.15E6
*EL PRINT,ELSET=EPRINT,POSITION=AVERAGED AT NODES,FREQ=0
S,
E,
*NODE PRINT,NSET=NPRINT
U,RF
*NODE FILE,NSET=NPRINT
U,RF
*OUTPUT,FIELD
*NODE OUTPUT,NSET=NPRINT
U,RF
*END STEP