*HEADING
 VERIFICATION TEST FOR CAXA4R2
 TRANSIENT DYNAMIC AND MODAL DYNAMIC ANALYSIS
*RESTART,WRITE,FREQ=1
*NODE
*NGEN,NSET=NALL
*ELEMENT,TYPE=CAXA4R2,OFFSET=1000
*ELGEN,ELSET=EALL
*SOLID SECTION,MATERIAL=STEEL,ELSET=EALL
*MATERIAL,NAME=STEEL
*ELASTIC
30.E6,.3
*DENSITY
0.730E-03,
*DAMPING, ALPHA=0.0, BETA=0.001
*EQUATION
**3
**1201,1,1.,1203,1,1.,1202,1,-2.
*NSET,NSET=BASE
*BOUNDARY
3,1
1003,1
2003,1
BASE,2
*ELSET,ELSET=EOUT
*NSET,NSET=NOUT
*NSET,NSET=NOUT2,GENERATE
*NSET,NSET=NOUT3,GENERATE
*NSET,NSET=NOUT4,GENERATE
*AMPLITUDE, NAME=WAVE
0.0, 0.0, 0.01, 0.58777, 0.02, 0.95104, 0.03, 0.95107
0.04, 0.58784, 0.05, 9.265E-05, 0.06, -0.58769, 0.07, -0.95104
0.08, -0.95107, 0.09, 0.58792, 0.1, -1.85E-04
**
**
*STEP
*FREQUENCY,EIGENSOLVER=SUBSPACE
20, , , 60
*MODAL FILE
*EL PRINT, F=0
*NODE PRINT, F=0
*END STEP
**
**
*STEP
*MODAL DYNAMIC
0.01, 0.1
*MODAL DAMPING, MODAL=DIRECT
*CLOAD, AMPLITUDE=WAVE
 203,1, 5000.0
2203,1,-5000.0
*EL PRINT, F=0
*NODE PRINT, F=0
*MODAL PRINT, F=0
*NODE FILE, FREQ=10, NSET=NOUT
U,V,A
*OUTPUT,HISTORY,FREQ=10
*NODE OUTPUT, NSET=NOUT
U,V,A
*OUTPUT,FIELD,FREQ=0
*END STEP
**
**
*STEP
*STEADY STATE DYNAMICS
8.0, 100.0, 5
*SELECT EIGENMODES,GENERATE
*MODAL DAMPING, MODAL=DIRECT
*CLOAD
 203,1, 5000.0
2203,1,-5000.0
*EL PRINT, F=0
*NODE PRINT, F=0
*NODE FILE, FREQ=5, NSET=NOUT
U,V,A
*OUTPUT,HISTORY,FREQ=5
*NODE OUTPUT, NSET=NOUT
U,V,A
*OUTPUT,FIELD,FREQ=0
*END STEP
**
**
*STEP
*STEADY STATE DYNAMICS, DIRECT
8.0, 100.0, 5
*CLOAD
 203,1, 5000.0
2203,1,-5000.0
*EL PRINT, F=0
*NODE PRINT, F=0
*NODE FILE, FREQ=5, NSET=NOUT
U,V,A
*OUTPUT,HISTORY,FREQ=5
*NODE OUTPUT, NSET=NOUT
U,V,A
*OUTPUT,FIELD,FREQ=0
*END STEP
**
**
*STEP
*STEADY STATE DYNAMICS, SUBSPACE PROJECTION=ALL,INTERVAL=RANGE
8.0, 100.0, 5,1.0
*SELECT EIGENMODES,GENERATE
*CLOAD
 203,1, 5000.0
2203,1,-5000.0
*EL PRINT, F=0
*NODE PRINT, F=0
*NODE FILE, FREQ=5, NSET=NOUT
U,V,A
*OUTPUT,HISTORY,FREQ=5
*NODE OUTPUT, NSET=NOUT
U,V,A
*OUTPUT,FIELD,FREQ=0
*END STEP
**
**
*STEP
*DYNAMIC
0.01, 0.1
*CLOAD, AMPLITUDE=WAVE
 203,1, 5000.0
2203,1,-5000.0
*NODE PRINT, FREQ=0
*EL PRINT, FREQ=0
*NODE FILE, FREQ=5, NSET=NOUT
U,V,A
*OUTPUT,HISTORY,FREQ=5
*NODE OUTPUT, NSET=NOUT
U,V,A
*OUTPUT,FIELD,FREQ=0
*END STEP