*HEADING
This is a test of angular acceleration loading for CPE8RP elements.
*NODE,NSET=ALL
*ELEMENT,TYPE=CPE8RP,ELSET=EALL
*SOLID SECTION,MATERIAL=STEEL,ELSET=EALL
1.      ,
*MATERIAL,NAME=STEEL
*ELASTIC
30.E6,.33
*PERMEABILITY
1.E-5     ,
*DENSITY
2000.   ,
*BOUNDARY
ALL,1,3
*INITIAL CONDITIONS, TYPE=RATIO
ALL,1.
*STEP
*STATIC
*DLOAD
EALL,ROTA,10.,0.,0.,0.,0,0,1
*NODE PRINT,TOTALS=YES
RF   ,
*EL PRINT
EVOL ,
*NODE FILE
RF   ,
*OUTPUT,FIELD
*NODE OUTPUT
RF,
*EL FILE,FREQ=0
*OUTPUT,FIELD,FREQ=0
*ELEMENT OUTPUT
*END STEP