*HEADING
*node,nset=plate
*element,type=sax1,elset=mass
*surface,name=sm1
1,sneg
*shell section, material=metal,elset=mass
0.05,
**
**
*node
*element,type=acax4r,elset=acax
*element,type=acinax2,elset=acinax
*elset,elset=ac
acax,acinax
*surface,name=acax
11,s1
*surface,name=acine
21,e1
**21,s3
*surface,name=acax42
11,s2
11,s4
*solid section,elset=ac,material=air
1.0,0.0,0.5,0.0
*tie,name=tie
acax,sm1
*impedance property,name=halfzmat
*material,name=air
*acoustic medium
*density
1.25
*material,name=metal
*elastic
2.e11,0.3
*density
7800.
*amplitude,definition=perio,name=TenPiHz
1,5.0,0.0, 0.0
0.0,1.0,0.0,0.0
**
**
*nset,nset=out
*step
*dynamic,explicit
,5.
*simpedance
acine,halfzmat
acax42,halfzmat
*boundary,type=acceleration,amplitude=tenpihz
plate,1,1,1.e-2
plate,2,6
*output,history
*node output, nset=out
por,
*end step