*HEADING
ECA8HHDD: DLOAD, DFLUX, FILM, AND RADIATION FOR COUPLED TEMP-DISP  [CGAX8HT]
*PREPRINT,ECHO=YES,HISTORY=NO,MODEL=NO
*NODE,NSET=ALL
*NSET,NSET=FIX1
*NSET,NSET=FIX2
*NSET,NSET=FIX3
*NSET,NSET=FIX4
*ELEMENT,TYPE=CGAX8HT, ELSET=EALL
*SOLID SECTION,MATERIAL=A1, ELSET=EALL, ORIENTATION=ORI
*surface,NAME=SIDE
1,S3
*PHYSICAL CONSTANTS, ABSOLUTE ZERO=-460., STEFAN BOLTZMANN=5.0E-8
*MATERIAL,NAME=A1
*ELASTIC
30.E6,0.3
*EXPANSION
0.,
*CONDUCTIVITY
3.77E-5,
*SPECIFIC HEAT
.39,
*DENSITY
82.9,
*ORIENTATION,NAME=ORI
*INITIAL CONDITIONS,TYPE=VELOCITY
ALL,1,10.
ALL,2,5.
*STEP
*COUPLED TEMPERATURE-DISPLACEMENT,STEADY STATE
1.,1.
*ENERGY FILE
*EL FILE
 LOADS,FLUXS
 FILM,RAD
*NODE FILE
 RF,
 NT,
 RFL,
*EL PRINT
 LOADS,FLUXS
 FILM,RAD
*NODE PRINT
 RF,
 NT,
 RFL,
*BOUNDARY,OP=NEW
ALL,1,2
ALL,5,5
FIX1,11
*DLOAD,OP=NEW
1,BR,100.
1,BZ,200.
*DFLUX,OP=NEW
1,BF,.3
*SECTION PRINT,NAME=SIDE1,SURFACE=SIDE,AXES=LOCAL
SOAREA,SOH
*SECTION FILE,NAME=SIDE1,SURFACE=SIDE,AXES=LOCAL
SOAREA,SOH
*END STEP
*STEP
*COUPLED TEMPERATURE-DISPLACEMENT,STEADY STATE
1.,1.
*BOUNDARY,OP=NEW
ALL,1,2
ALL,5,5
FIX1,11
*DFLUX,OP=NEW
1,BF,.3
*END STEP
*STEP
*COUPLED TEMPERATURE-DISPL,STEADY STATE
*BOUNDARY,OP=NEW
ALL,1,2
ALL,5,5
FIX3,11
*DLOAD,OP=NEW
1,CENT,20.,0.,0.,0.,0.,1.,0.
*DFLUX,OP=NEW
1,S1,.3
*END STEP
*STEP
*COUPLED TEMPERATURE-DISPLACEMENT, STEADY STATE
1.,1.
*BOUNDARY,OP=NEW
ALL,1,2
ALL,5,5
FIX3,11
*DLOAD,OP=NEW
1,CENTRIF,0.241,0.,0.,0.,0.,1.,0.
*DFLUX,OP=NEW
1,S1,.3
*END STEP
*STEP
*COUPLED TEMPERATURE-DISPLACEMENT, STEADY STATE
1.,1.
*DLOAD,OP=NEW
1,GRAV,400.,0.,-1.,0.
*END STEP
*STEP
*COUPLED TEMPERATURE-DISPL,STEADY STATE
*BOUNDARY,OP=NEW
ALL,1,2
ALL,5,5
FIX3,11
*DFLUX,OP=NEW
1,S1,.3
*END STEP
*STEP
*COUPLED TEMPERATURE-DISPLACEMENT,STEADY STATE
1.,1.
*SOLUTION TECHNIQUE,TYPE=SEPARATED
*BOUNDARY,OP=NEW
ALL,1,2
ALL,5,5
FIX4,11
*DLOAD,OP=NEW
1,P1,100.
1,P2,200.
1,P3,300.
1,P4,400.
*DFLUX,OP=NEW
1,S2,.3
*END STEP
*STEP
*COUPLED TEMPERATURE-DISPL,STEADY STATE
*BOUNDARY,OP=NEW
ALL,1,2
ALL,5,5
FIX1,11
*DLOAD,OP=NEW
1,HP1,3000.,3.,0.
*DFLUX,OP=NEW
1,S3,.3
*END STEP
*STEP
*COUPLED TEMPERATURE-DISPL,STEADY STATE
*BOUNDARY,OP=NEW
ALL,1,2
ALL,5,5
FIX2,11
*DLOAD,OP=NEW
1,HP2,3000.,3.,0.
*DFLUX,OP=NEW
1,S4,.3
*END STEP
*STEP
*COUPLED TEMPERATURE-DISPL,STEADY STATE
*DLOAD,OP=NEW
1,HP3,3000.,3.,0.
*DFLUX,OP=NEW
*FILM,OP=NEW
1,F1,75.,.103
*BOUNDARY,OP=NEW
ALL,1,2
ALL,5,5
FIX3,11
*END STEP
*STEP
*COUPLED TEMPERATURE-DISPL,STEADY STATE
*DLOAD,OP=NEW
1,HP4,3000.,3.,0.
*FILM,OP=NEW
1,F2,75.,.103
*BOUNDARY,OP=NEW
ALL,1,2
ALL,5,5
FIX4,11
*END STEP
*STEP
*COUPLED TEMPERATURE-DISPL,STEADY STATE
*DLOAD,OP=NEW
*FILM,OP=NEW
1,F3,75.,.103
*BOUNDARY,OP=NEW
ALL,1,2
ALL,5,5
FIX1,11
*END STEP
*STEP
*COUPLED TEMPERATURE-DISPL,STEADY STATE
*FILM,OP=NEW
1,F4,75.,.103
*BOUNDARY,OP=NEW
ALL,1,2
ALL,5,5
FIX2,11
*END STEP
*STEP
*COUPLED TEMPERATURE-DISPL,STEADY STATE
*FILM,OP=NEW
*RADIATE,OP=NEW
1,R1,75.,1.E-06
*BOUNDARY,OP=NEW
ALL,1,2
ALL,5,5
FIX3,11
*END STEP
*STEP
*COUPLED TEMPERATURE-DISPL,STEADY STATE
*RADIATE,OP=NEW
1,R2,75.,1.E-06
*BOUNDARY,OP=NEW
ALL,1,2
ALL,5,5
FIX4,11
*END STEP
*STEP
*COUPLED TEMPERATURE-DISPL,STEADY STATE
*RADIATE,OP=NEW
1,R3,75.,1.E-06
*BOUNDARY,OP=NEW
ALL,1,2
ALL,5,5
FIX1,11
*END STEP
*STEP
*COUPLED TEMPERATURE-DISPL,STEADY STATE
*RADIATE,OP=NEW
1,R4,75.,1.E-06
*BOUNDARY,OP=NEW
ALL,1,2
ALL,5,5
FIX2,11
*END STEP