*HEADING
ECA8GFDI: *DSLAOD AND *TEMPERATURE FOR STRESS-DISPLACEMENT ELEMENTS  [CGAX8]
*NODE,NSET=ALL
*NGEN,NSET=ALL
*ELEMENT,TYPE=CGAX8, ELSET=EALL
*surface, NAME=SIDE_1
 1, S1
*surface, NAME=SIDE_2
 1, S2
*surface, NAME=SIDE_3
 1, S3
*surface, NAME=SIDE_4
 1, S4
*SOLID SECTION,MATERIAL=A1, ELSET=EALL
*MATERIAL,NAME=A1
*ELASTIC
 3.E6,0.3
*DENSITY
5.E-5,
*BOUNDARY
 ALL,1,2
 ALL,5,5
*STEP,PERTURBATION
*STATIC
*DSLOAD
 SIDE_1,P,1000.
*ENERGY FILE
*NODE FILE
 RF,
*EL PRINT
 LOADS,
*EL FILE
 LOADS,
*NODE PRINT
 RF,
*END STEP
*STEP,PERTURBATION
*STATIC
*DSLOAD
 SIDE_2,P,2000.
*END STEP
*STEP,PERTURBATION
*STATIC
*DSLOAD
 SIDE_3,P,3000.
*END STEP
*STEP,PERTURBATION
*STATIC
*DSLOAD
 SIDE_4,P,3000.
*END STEP
*STEP,PERTURBATION
*STATIC
*DSLOAD
 SIDE_1,HP,3000.,3.,0.
*END STEP
*STEP,PERTURBATION
*STATIC
*DSLOAD
 SIDE_2,HP,3000.,3.,0.
*END STEP
*STEP,PERTURBATION
*STATIC
*DSLOAD
 SIDE_3,HP,3000.,3.,0.
*END STEP
*STEP,PERTURBATION
*STATIC
*DSLOAD
 SIDE_4,HP,3000.,3.,0.
*END STEP