*Heading
** Job name: TEMP Model name: Model-1
**
** PARTS
**
*Part, name=PART-1
*End Part
**
** ASSEMBLY
**
*Assembly, name=Assembly
**
*Instance, name=PART-1-1, part=PART-1
*Node
*Element, type=CGAX4T
*Elset, elset=AXSOL
** Region: (Section-1-AXSOL:AXSOL)
*Elset, elset=_I1, internal
** Section: Section-1-AXSOL
*Solid Section, elset=_I1, material=ELMAT
1.,
*ORIENTATION,NAME=REBAR1,DEFINITION=OFFSET TO NODES
*ELEMENT,TYPE=SFMGAX1,ELSET=SFMGAX1-1
*SURFACE SECTION,ELSET=SFMGAX1-1
*REBAR LAYER
RB1LAYR1,0.040000,0.333300,0.000000,RBMAT1,90.000000,1
*ELEMENT,TYPE=SFMGAX1,ELSET=SFMGAX1-2
*SURFACE SECTION,ELSET=SFMGAX1-2
*REBAR LAYER
RB1LAYR2,0.040000,0.333300,0.000000,RBMAT1,90.000000,1
*ELEMENT,TYPE=SFMGAX1,ELSET=SFMGAX1-3
*SURFACE SECTION,ELSET=SFMGAX1-3
*REBAR LAYER
RB1LAYR3,0.040000,0.333300,0.000000,RBMAT1,90.000000,1
*ELEMENT,TYPE=SFMGAX1,ELSET=SFMGAX1-4
*SURFACE SECTION,ELSET=SFMGAX1-4
*REBAR LAYER,ANGULAR SPACING
RB2LAYR1,0.040000,46.245212,0.000000,RBMAT2,0.000000,1
*ELEMENT,TYPE=SFMGAX1,ELSET=SFMGAX1-5
*SURFACE SECTION,ELSET=SFMGAX1-5
*REBAR LAYER,ANGULAR SPACING
RB2LAYR2,0.040000,46.245212,0.000000,RBMAT2,0.000000,1
*ELEMENT,TYPE=SFMGAX1,ELSET=SFMGAX1-6
*SURFACE SECTION,ELSET=SFMGAX1-6
*REBAR LAYER,ANGULAR SPACING
RB2LAYR3,0.040000,46.245212,0.000000,RBMAT2,0.000000,1
*EMBEDDED ELEMENT
*End Instance
*Nset, nset=BOT, instance=PART-1-1
*Nset, nset=LEFT, instance=PART-1-1
*Nset, nset=TOP, instance=PART-1-1
*Elset, elset=__M6_S2, internal, instance=PART-1-1
*Surface, type=ELEMENT, name=_M6, internal
__M6_S2, S2
*Elset, elset=__M7_S2, internal, instance=PART-1-1
*Surface, type=ELEMENT, name=_M7, internal
__M7_S2, S2
*End Assembly
**
** MATERIALS
**
*Material, name=ELMAT
*Conductivity
1.,
*Elastic
1.,0.
*Material, name=RBMAT1
*Elastic
 3e+07,0.
*Material, name=RBMAT2
*Elastic
 3e+07,0.
**
** BOUNDARY CONDITIONS
**
** Name: Disp-BC-1 Type: Displacement/Rotation
*Boundary
LEFT, 1, 1
** Name: Disp-BC-2 Type: Displacement/Rotation
*Boundary
BOT, 2, 2
** Name: Disp-BC-3 Type: Displacement/Rotation
*Boundary
BOT, 5, 5
** Name: Disp-BC-4 Type: Displacement/Rotation
*Boundary
TOP, 2, 2
** ----------------------------------------------------------------
**
** STEP: Step-1
**
*Step, name=Step-1, perturbation
*Static
**
** LOADS
**
** Name: DISTFORCE-1   Type: Pressure
*Dsload
_M6, P, -1000.
**
** OUTPUT REQUESTS
**
*Restart, write, frequency=0
**
** FIELD OUTPUT: F-Output-1
**
*Output, field, variable=PRESELECT
**
** HISTORY OUTPUT: H-Output-1
**
*Output, history, variable=PRESELECT
*EL FILE,REBAR
 S,E,
*NODE FILE
 U,RF,
 COORD,
*EL PRINT,REBAR
 S,E,
*NODE PRINT
 U,RF,
 COORD,
*End Step
** ----------------------------------------------------------------
**
** STEP: Step-2
**
*Step, name=Step-2, nlgeom
LARGEDISPLACEMENTANALYSIS
*Coupled Temperature-Displacement, steady state
1., 1.,
**
** LOADS
**
** Name: DISTFORCE-2   Type: Pressure
*Dsload
_M7, P, -1000.
**
** OUTPUT REQUESTS
**
*Restart, write, frequency=0
**
** FIELD OUTPUT: F-Output-2
**
*Output, field, variable=PRESELECT
**
** HISTORY OUTPUT: H-Output-2
**
*Output, history, variable=PRESELECT
*EL FILE,REBAR
 S,E,
*NODE FILE
 U,RF,
 COORD,
*EL PRINT,REBAR
 S,E,
*NODE PRINT
 U,RF,
 COORD,
*End Step