*HEADING
IMPEDANCE PROPERTY  [ACAX4R]
***************************
*PARAMETER
f=100.0
T=5/f
omega=2*3.14159*f
***************************
*NODE, Nset=ODB_NSET
*NGEN,NSET=NALL
*ELEMENT,TYPE=ACAX4R,ELSET=EALL
*ELGEN,ELSET=EALL
*ELSET,ELSET=LINER3
*MATERIAL,NAME=AIR
*DENSITY
1.293,
*ACOUSTIC MEDIUM,BULK MODULUS
*SOLID SECTION,MATERIAL=AIR,ELSET=EALL
*IMPEDANCE PROPERTY,NAME=IMPED
*NSET,NSET=RECRD,GEN
*NSET,NSET=DRIV
**
*NSET, NSET=MID
*NSET, NSET=ODB_NSET
ODB_NSET, MID
*NSET, NSET=QA_TEST
ODB_NSET,
**
*AMPLITUDE,NAME=SINE,DEF=PERIODIC
1,<omega>,0.0,0.0
0,1,0,0
*STEP
*DYNAMIC,EXPLICIT
,<T>
*BULK VISCOSITY
*IMPEDANCE
LINER3,I3,IMPED
*BOUNDARY, AMP=SINE
DRIV,8,,1.
*OUTPUT,FIELD,NUM=1
*NODE OUTPUT
POR,
*NODE OUTPUT,NSET=QA_TEST
POR,
***OUTPUT,HISTORY,FREQ=1
***NODE OUTPUT,NSET=ODB_NSET
** POR,
*ENDSTEP