*HEADING
EC3RSYEB: EIGENVALUE ANALYSIS OF AN UNCONSTRAINED 1-ELEMENT MESH  [C3D27RH]
*PREPRINT,ECHO=YES,HISTORY=NO,MODEL=NO
*NODE
*NGEN,NSET=ALL
*ELEMENT,TYPE=C3D27RH, ELSET=EALL
*SOLID SECTION,MATERIAL=A1, ELSET=EALL
*MATERIAL,NAME=A1
*ELASTIC,TYPE=ISOTROPIC
 3.E6,0.3
*DENSITY
7.5E-4,
*STEP
*FREQUENCY, eigensolver=lanczos
37, , ,-1.E6
*OUTPUT,FIELD
*MODAL OUTPUT
*END STEP