*HEADING
Test of angular acceleration loading for C3D20RP elements.
*RESTART,WRITE
*NODE,NSET=NALL
*ELEMENT,TYPE=C3D20RP,ELSET=EALL
*SOLID SECTION,MATERIAL=STEEL,ELSET=EALL
*MATERIAL,NAME=STEEL
*ELASTIC
30.E6,.33
*DENSITY
2000.,
*PERMEABILITY
1.E-5,
*BOUNDARY
NALL,1,3
*INITIAL CONDITIONS, TYPE=RATIO
NALL,1.
*STEP
*STATIC
*DLOAD
EALL,ROTA,10.,0.,0.,0.,0,0,1
*NODE PRINT,TOTALS=YES
RF,
*EL PRINT,FREQ=0
*OUTPUT,FIELD
*NODE OUTPUT
RF,
*OUTPUT,FIELD,FREQ=0
*ELEMENT OUTPUT
*END STEP