*HEADING
EC3KPFDE: DLOAD, FLOW, AND DFLOW FOR PORE PRESSURE ELEMENTS  [C3D20P]
*PREPRINT,ECHO=YES,HISTORY=NO,MODEL=NO
*NODE
*NGEN, NSET=FACE3
*NGEN, NSET=FACE5
*NSET, NSET=FACE1
*NSET, NSET=FACE2
*NSET, NSET=FACE4
*NSET, NSET=FACE6
*NSET,NSET=CORNERS1
*NSET,NSET=CORNERS2
*NSET,NSET=CORNERS3
*NSET,NSET=CORNERS4
*NSET,NSET=CORNERS5
*NSET,NSET=CORNERS6
*NSET,NSET=NALL, GENERATE
*NSET,NSET=CORNERS
*ELEMENT, TYPE=C3D20P, ELSET=EALL
*SOLID SECTION,MATERIAL=A1, ELSET=EALL
*MATERIAL,NAME=A1
*ELASTIC
 1.E8,
*PERMEABILITY
 1.E-5,
*DENSITY
 1.7321,
*INITIAL CONDITIONS,TYPE=RATIO
NALL,1.
*INITIAL CONDITIONS,TYPE=PORE PRESSURE
NALL,0.
*STEP
*SOILS,CONSOLIDATION
*ENERGY FILE
*EL FILE
 LOADS,
*NODE FILE
 RF,
 POR,
*EL PRINT
 LOADS,
*NODE PRINT,TOTALS=YES
 RF,
*NODE PRINT
 POR,
*BOUNDARY, OP=NEW
 NALL, 1,3
 CORNERS, 8
*DLOAD,OP=NEW
1,CENTRIF,100.,0.,2.5,-.5,0.,0.,1.
*END STEP
*STEP
*SOILS, CONSOLIDATION
*DLOAD, OP=NEW
 1, BX, 100.
 1, BY, 100.
 1, BZ, 100.
*END STEP
*STEP
*SOILS,CONSOLIDATION
*DLOAD, OP=NEW
 1, GRAV, 100.,1,1,1
*END STEP
*STEP
*SOILS,CONSOLIDATION
*DLOAD, OP=NEW
 1, P1, 100.
 1, P2, 100.
*END STEP
*STEP
*SOILS,CONSOLIDATION
*DLOAD, OP=NEW
 1, P3, 100.
 1, P5, 100.
*END STEP
*STEP
*SOILS,CONSOLIDATION
*DLOAD, OP=NEW
 1, P4, 100.
 1, P6, 100.
*END STEP
*STEP
*SOILS,CONSOLIDATION
*DLOAD, OP=NEW
 1, HP1, 100., 5., 0.
 1, HP2, 100., 5., 0.
*END STEP
*STEP
*SOILS,CONSOLIDATION
*DLOAD, OP=NEW
 1, HP3, 300., 5., 0.
 1, HP5, 100., 5., 0.
*END STEP
*STEP
*SOILS,CONSOLIDATION
*DLOAD, OP=NEW
 1, HP4, 100., 5., 0.
 1, HP6, 100., 5., 0.
*END STEP
*STEP
*SOILS,CONSOLIDATION
*BOUNDARY, OP=NEW
 NALL, 1,3
 CORNERS2, 8
*DLOAD, OP=NEW
*FLOW, OP=NEW
 1, Q1NU, 14.7, 2.E-5
*END STEP
*STEP
*SOILS,CONSOLIDATION
*BOUNDARY,OP=NEW
 NALL, 1,3
 CORNERS1, 8
*FLOW, OP=NEW
 1, Q2, 14.7, 2.E-5
*END STEP
*STEP
*SOILS,CONSOLIDATION
*BOUNDARY, OP=NEW
 NALL, 1,3
 CORNERS5, 8
*FLOW, OP=NEW
 1, Q3, 14.7, 2.E-5
*END STEP
*STEP
*SOILS,CONSOLIDATION
*BOUNDARY, OP=NEW
 NALL, 1,3
 CORNERS6, 8
*FLOW, OP=NEW
 1, Q4, 14.7, 2.E-5
*END STEP
*STEP
*SOILS,CONSOLIDATION
*BOUNDARY, OP=NEW
 NALL, 1,3
 CORNERS3, 8
*FLOW, OP=NEW
 1, Q5, 14.7, 2.E-5
*END STEP
*STEP
*SOILS,CONSOLIDATION
*BOUNDARY, OP=NEW
 NALL, 1,3
 CORNERS4, 8
*FLOW, OP=NEW
 1, Q6, 14.7, 2.E-5
*END STEP
*STEP
*SOILS,CONSOLIDATION
*BOUNDARY, OP=NEW
 NALL, 1,3
*DLOAD, OP=NEW
*FLOW, OP=NEW
 1, Q2  , 14.7, 2.E-5
 1, Q1D, 0.2
*END STEP
*STEP
*SOILS,CONSOLIDATION
*BOUNDARY,OP=NEW
 NALL, 1,3
*FLOW, OP=NEW
 1, Q1  , 14.7, 2.E-5
 1, Q2D, 0.2
*END STEP
*STEP
*SOILS,CONSOLIDATION
*BOUNDARY, OP=NEW
 NALL, 1,3
*FLOW, OP=NEW
 1, Q5  , 14.7, 2.E-5
 1, Q3D, 0.2
*END STEP
*STEP
*SOILS,CONSOLIDATION
*BOUNDARY, OP=NEW
 NALL, 1,3
*FLOW, OP=NEW
 1, Q3  , 14.7, 2.E-5
 1, Q5D, 0.2
*END STEP
*STEP
*SOILS,CONSOLIDATION
*BOUNDARY, OP=NEW
 NALL, 1,3
*FLOW, OP=NEW
 1, Q6  , 14.7, 2.E-5
 1, Q4D, 0.2
*END STEP
*STEP
*SOILS,CONSOLIDATION
*BOUNDARY, OP=NEW
 NALL, 1,3
*FLOW, OP=NEW
 1, Q4  , 14.7, 2.E-5
 1, Q6D, 0.2
*END STEP
*STEP
*SOILS,CONSOLIDATION
*BOUNDARY, OP=NEW
 NALL, 1,3
*DLOAD, OP=NEW
*FLOW, OP=NEW
 1, Q2  , -14.7, 2.E-5
 1, Q1D, 0.2
*END STEP
*STEP
*SOILS,CONSOLIDATION
*BOUNDARY,OP=NEW
 NALL, 1,3
*FLOW, OP=NEW
 1, Q1  , -14.7, 2.E-5
 1, Q2D, 0.2
*END STEP
*STEP
*SOILS,CONSOLIDATION
*BOUNDARY, OP=NEW
 NALL, 1,3
*FLOW, OP=NEW
 1, Q5  , -14.7, 2.E-5
 1, Q3D, 0.2
*END STEP
*STEP
*SOILS,CONSOLIDATION
*BOUNDARY, OP=NEW
 NALL, 1,3
*FLOW, OP=NEW
 1, Q3  , -14.7, 2.E-5
 1, Q5D, 0.2
*END STEP
*STEP
*SOILS,CONSOLIDATION
*BOUNDARY, OP=NEW
 NALL, 1,3
*FLOW, OP=NEW
 1, Q6  , -14.7, 2.E-5
 1, Q4D, 0.2
*END STEP
*STEP
*SOILS,CONSOLIDATION
*BOUNDARY, OP=NEW
 NALL, 1,3
*FLOW, OP=NEW
 1, Q4  , -14.7, 2.E-5
 1, Q6D, 0.2
*END STEP
*STEP
*SOILS,CONSOLIDATION
*BOUNDARY, OP=NEW
 NALL, 1,3
 CORNERS2, 8
*FLOW, OP=NEW
*DFLOW, OP=NEW
 1, S1NU, 3.E-5
*END STEP
*STEP
*SOILS,CONSOLIDATION
*BOUNDARY, OP=NEW
 NALL, 1,3
 CORNERS1, 8
*DFLOW, OP=NEW
 1, S2, 3.E-5
*END STEP
*STEP
*SOILS,CONSOLIDATION
*BOUNDARY, OP=NEW
 NALL, 1,3
 CORNERS5, 8
*DFLOW, OP=NEW
 1, S3, 3.E-5
*END STEP
*STEP
*SOILS,CONSOLIDATION
*BOUNDARY, OP=NEW
 NALL, 1,3
 CORNERS6, 8
*DFLOW, OP=NEW
 1, S4, 3.E-5
*END STEP
*STEP
*SOILS,CONSOLIDATION
*BOUNDARY, OP=NEW
 NALL, 1,3
 CORNERS3, 8
*DFLOW, OP=NEW
 1, S5, 3.E-5
*END STEP
*STEP
*SOILS,CONSOLIDATION
*BOUNDARY, OP=NEW
 NALL, 1,3
 CORNERS4, 8
*DFLOW, OP=NEW
 1, S6, 3.E-5
*END STEP