*HEADING
EC3FDFDJ: *DSFLUX, *SFILM, AND *SRADIATION FOR HEAT TRANSFER ELEMENTS  [DC3D15]
*NODE
*ELEMENT,TYPE=DC3D15,ELSET=ALLELS
*surface, NAME=SIDE_1
 1, S2
 2, S2
*surface, NAME=SIDE_2
 1, S1
 2, S1
*surface, NAME=SIDE_3
 1, S3
*surface, NAME=SIDE_4
 2, S3
*surface, NAME=SIDE_5
 2, S4
*surface, NAME=SIDE_6
 1, S5
*SOLID SECTION,MATERIAL=A1, ELSET=ALLELS
*PHYSICAL CONSTANTS, ABSOLUTE ZERO=-460., STEFAN BOLTZMANN=5.E-8
*MATERIAL,NAME=A1
*CONDUCTIVITY
 3.77E-5,
*DENSITY
 82.9,
*SPECIFIC HEAT
 .39,
*NSET,NSET=FIX1
*NSET,NSET=FIX2
*NSET,NSET=FIX3
*NSET,NSET=FIX4
*NSET,NSET=FIX5
*NSET,NSET=FIX6
*BOUNDARY
 FIX1,11
*STEP
*HEAT TRANSFER, STEADY STATE
*NODE PRINT
 NT,RFL
*OUTPUT,FIELD
*NODE OUTPUT
 NT,RFL
*EL PRINT,FREQ=0
*OUTPUT,FIELD
*ELEMENT OUTPUT
*DFLUX
 ALLELS, BF, .3
*END STEP
*STEP
*HEAT TRANSFER, STEADY STATE
*DFLUX,OP=NEW
*SFILM, OP=NEW
 SIDE_1, F, 75., .103
*END STEP
*STEP
*HEAT TRANSFER,STEADY STATE
*SFILM,OP=NEW
 SIDE_2, F, 75., .103
*BOUNDARY,OP=NEW
 FIX2, 11
*END STEP
*STEP
*HEAT TRANSFER,STEADY STATE
*SFILM,OP=NEW
 SIDE_3, F, 75., .103
*BOUNDARY,OP=NEW
 FIX5, 11
*END STEP
*STEP
*HEAT TRANSFER,STEADY STATE
*SFILM,OP=NEW
 SIDE_4, F, 75., .103
*BOUNDARY,OP=NEW
 FIX6, 11
*END STEP
*STEP
*HEAT TRANSFER,STEADY STATE
*SFILM,OP=NEW
 SIDE_5, F, 75., .103
*BOUNDARY,OP=NEW
 FIX3, 11
*END STEP
*STEP
*HEAT TRANSFER,STEADY STATE
*SFILM,OP=NEW
 SIDE_6, F, 75., .103
*BOUNDARY,OP=NEW
 FIX4, 11
*END STEP
*STEP
*HEAT TRANSFER, STEADY STATE
*SFILM, OP=NEW
*SRADIATE, OP=NEW
 SIDE_1, R, 75., 1.E-6
*BOUNDARY,OP=NEW
 FIX1, 11
*END STEP
*STEP
*HEAT TRANSFER, STEADY STATE
*SRADIATE, OP=NEW
 SIDE_2, R, 75., 1.E-6
*BOUNDARY,OP=NEW
 FIX2,11
*END STEP
*STEP
*HEAT TRANSFER, STEADY STATE
*SRADIATE, OP=NEW
 SIDE_3, R, 75., 1.E-6
*BOUNDARY,OP=NEW
 FIX5,11
*END STEP
*STEP
*HEAT TRANSFER, STEADY STATE
*SRADIATE, OP=NEW
 SIDE_4, R, 75., 1.E-6
*BOUNDARY, OP=NEW
 FIX6,11
*END STEP
*STEP
*HEAT TRANSFER, STEADY STATE
*SRADIATE, OP=NEW
 SIDE_5, R, 75., 1.E-6
*BOUNDARY,OP=NEW
 FIX3,11
*END STEP
*STEP
*HEAT TRANSFER, STEADY STATE
*SRADIATE, OP=NEW
 SIDE_6, R, 75., 1.E-6
*BOUNDARY, OP=NEW
 FIX4,11
*END STEP
*STEP
*HEAT TRANSFER, STEADY STATE
*BOUNDARY, OP=NEW
 FIX2, 11
*SRADIATE, OP=NEW
*DSFLUX, OP=NEW
 SIDE_1, S, .3
*END STEP
*STEP
*HEAT TRANSFER, STEADY STATE
*BOUNDARY, OP=NEW
 FIX1, 11
*DSFLUX,OP=NEW
 SIDE_2, S, .3
*END STEP
*STEP
*HEAT TRANSFER, STEADY STATE
*BOUNDARY, OP=NEW
 FIX5, 11
*DSFLUX,OP=NEW
 SIDE_3, S, .3
*END STEP
*STEP
*HEAT TRANSFER, STEADY STATE
*BOUNDARY, OP=NEW
 FIX6, 11
*DSFLUX,OP=NEW
 SIDE_4, S, .3
*END STEP
*STEP
*HEAT TRANSFER, STEADY STATE
*BOUNDARY, OP=NEW
 FIX3, 11
*DSFLUX,OP=NEW
 SIDE_5, S, .3
*END STEP
*STEP
*HEAT TRANSFER, STEADY STATE
*BOUNDARY, OP=NEW
 FIX4, 11
*DSFLUX,OP=NEW
 SIDE_6, S, .3
*END STEP