*HEADING
EC38SFS2: PRESSURE AND HYDROSTATIC PRESSURE FOR 3-D SOLIDS  [C3D8]
*PREPRINT,ECHO=YES,HISTORY=NO,MODEL=NO
*RESTART, WRITE
*NODE
*ELEMENT,TYPE=C3D8, ELSET=EALL
*SOLID SECTION,MATERIAL=A1, ELSET=EALL
*MATERIAL,NAME=A1
*ELASTIC,TYPE=ISOTROPIC
 30.0E6,0.3
*BOUNDARY
 1,1,3
 2,2
 4,3
 5,1
*surface, name=side1485
1,s6
*STEP
*STATIC
*DLOAD,OP=NEW
 1, P1, 1000.0
 1, P2, 1000.0
 1, P3, 1000.0
 1, P4, 1000.0
 1, P5, 1000.0
 1, P6, 1000.0
*CLOAD
 2,1,  1500.00
 3,1,   500.00
 3,2,   500.00
 3,3, -1000.00
 4,1,   500.00
 4,2,  1500.00
 5,2,  -500.00
 5,3,  1000.00
*NODE PRINT
 U,COORD
*NODE PRINT
 RF,CF
*EL PRINT
 S,
 COORD,
 E,
 LOADS,
*SECTION PRINT, NAME=side, surface=side1485,axes=local
*SECTION FILE, NAME=side, surface=side1485,axes=local
**analytical results
**SOFM        SOF1        SOF2        SOF3
**3464.       2000.       2000.       2000.
**SOMM        SOM1        SOM2        SOM3
**2828.       0.0         2000.      -2000.
**SOAREA      SOCF1       SOCF2       SOCF3
**2.000      0.6667      0.6667      0.1667
*END STEP