*HEADING
EC34DFDJ: *DSFLUX, *SFILM, AND *SRADIATION FOR HEAT TRANSFER ELEMENTS  [DC3D4]
*NODE
*ELEMENT,TYPE=DC3D4,ELSET=ALL_ELEMENTS
*surface, NAME=SIDE_1
 2, S3
 3, S3
*surface, NAME=SIDE_2
 1, S1
 4, S1
*surface, NAME=SIDE_3
 1, S2
 2, S1
*surface, NAME=SIDE_4
 1, S3
 3, S2
*surface, NAME=SIDE_5
 3, S1
 4, S3
*surface, NAME=SIDE_6
 2, S2
 4, S4
*SOLID SECTION,MATERIAL=A1, ELSET=ALL_ELEMENTS
*PHYSICAL CONSTANTS, ABSOLUTE ZERO=-460.,STEFAN BOLTZMAN=5.E-8
*MATERIAL,NAME=A1
*CONDUCTIVITY
 3.77E-5,
*DENSITY
 82.9,
*SPECIFIC HEAT
 .39,
*NSET,NSET=NODESET1_FIX
*NSET,NSET=NODESET2_FIX
*NSET,NSET=NODESET3_FIX
*NSET,NSET=NODESET4_FIX
*NSET,NSET=NODESET5_FIX
*NSET,NSET=NODESET6_FIX
*BOUNDARY
 NODESET1_FIX,11
*STEP
*HEAT TRANSFER, STEADY STATE
*NODE PRINT
 NT,RFL
*OUTPUT,FIELD
*NODE OUTPUT
 NT,RFL
*EL PRINT,FREQ=0
*OUTPUT,FIELD
*ELEMENT OUTPUT
*DFLUX
 ALL_ELEMENTS, BF, .3
*END STEP
*STEP
*HEAT TRANSFER, STEADY STATE
*DFLUX,OP=NEW
*SFILM, OP=NEW
 SIDE_1, F, 75., .103
*END STEP
*STEP
*HEAT TRANSFER,STEADY STATE
*SFILM,OP=NEW
 SIDE_2, F, 75., .103
*BOUNDARY,OP=NEW
 NODESET2_FIX, 11
*END STEP
*STEP
*HEAT TRANSFER,STEADY STATE
*SFILM,OP=NEW
 SIDE_3, F, 75., .103
*BOUNDARY,OP=NEW
 NODESET5_FIX, 11
*END STEP
*STEP
*HEAT TRANSFER,STEADY STATE
*SFILM,OP=NEW
 SIDE_4, F, 75., .103
*BOUNDARY,OP=NEW
 NODESET6_FIX, 11
*END STEP
*STEP
*HEAT TRANSFER,STEADY STATE
*SFILM,OP=NEW
 SIDE_5, F, 75., .103
*BOUNDARY,OP=NEW
 NODESET3_FIX, 11
*END STEP
*STEP
*HEAT TRANSFER,STEADY STATE
*SFILM,OP=NEW
 SIDE_6, F, 75., .103
*BOUNDARY,OP=NEW
 NODESET4_FIX, 11
*END STEP
*STEP
*HEAT TRANSFER, STEADY STATE
*SFILM, OP=NEW
*SRADIATE, OP=NEW
 SIDE_1, R, 75., 1.E-6
*BOUNDARY,OP=NEW
 NODESET1_FIX, 11
*END STEP
*STEP
*HEAT TRANSFER, STEADY STATE
*SRADIATE, OP=NEW
 SIDE_2, R, 75., 1.E-6
*BOUNDARY,OP=NEW
 NODESET2_FIX,11
*END STEP
*STEP
*HEAT TRANSFER, STEADY STATE
*SRADIATE, OP=NEW
 SIDE_3, R, 75., 1.E-6
*BOUNDARY,OP=NEW
 NODESET5_FIX,11
*END STEP
*STEP
*HEAT TRANSFER, STEADY STATE
*SRADIATE, OP=NEW
 SIDE_4, R, 75., 1.E-6
*BOUNDARY, OP=NEW
 NODESET6_FIX,11
*END STEP
*STEP
*HEAT TRANSFER, STEADY STATE
*SRADIATE, OP=NEW
 SIDE_5, R, 75., 1.E-6
*BOUNDARY,OP=NEW
 NODESET3_FIX,11
*END STEP
*STEP
*HEAT TRANSFER, STEADY STATE
*SRADIATE, OP=NEW
 SIDE_6, R, 75., 1.E-6
*BOUNDARY, OP=NEW
 NODESET4_FIX,11
*END STEP
*STEP
*HEAT TRANSFER, STEADY STATE
*BOUNDARY, OP=NEW
 NODESET2_FIX, 11
*SRADIATE, OP=NEW
*DSFLUX, OP=NEW
 SIDE_1, S, .3
*END STEP
*STEP
*HEAT TRANSFER, STEADY STATE
*BOUNDARY, OP=NEW
 NODESET1_FIX, 11
*DSFLUX,OP=NEW
 SIDE_2, S, .3
*END STEP
*STEP
*HEAT TRANSFER, STEADY STATE
*BOUNDARY, OP=NEW
 NODESET5_FIX, 11
*DSFLUX,OP=NEW
 SIDE_3, S, .3
*END STEP
*STEP
*HEAT TRANSFER, STEADY STATE
*BOUNDARY, OP=NEW
 NODESET6_FIX, 11
*DSFLUX,OP=NEW
 SIDE_4, S, .3
*END STEP
*STEP
*HEAT TRANSFER, STEADY STATE
*BOUNDARY, OP=NEW
 NODESET3_FIX, 11
*DSFLUX,OP=NEW
 SIDE_5, S, .3
*END STEP
*STEP
*HEAT TRANSFER, STEADY STATE
*BOUNDARY, OP=NEW
 NODESET4_FIX, 11
*DSFLUX,OP=NEW
 SIDE_6, S, .3
*END STEP