*HEADING
EC23AFAR: IMPEDANCE PROPERTY  [AC2D3]
*NODE, Nset=ODB_NSET
*NGEN,NSET=NALL
*ELEMENT,TYPE=AC2D3,ELSET=EALL
*ELSET,ELSET=LINER3
*MATERIAL,NAME=AIR
*DENSITY
1.293,
*ACOUSTIC MEDIUM,BULK MODULUS
*SOLID SECTION,MATERIAL=AIR,ELSET=EALL
*IMPEDANCE PROPERTY,NAME=IMPED
*NSET,NSET=QA_TEST,GEN
*NSET,NSET=DRIV
**
*STEP
*STEADY STATE DYNAMIC,DIRECT
*IMPEDANCE
LINER3,I1,IMPED
*BOUNDARY
DRIV,8,,1.
*NODE PRINT,NSET=QA_TEST
POR,
*OUTPUT,FIELD, OP=NEW
*NODE OUTPUT,NSET=QA_TEST
POR,
*OUTPUT,HISTORY,OP=ADD
*NODE OUTPUT,NSET=QA_TEST
POR,
*END STEP