*HEADING
: T SECTION  [B32OSH]
*NODE
*NGEN,NSET=ALL
*ELEMENT,TYPE=B32OSH, ELSET=EALL
*ELSET, ELSET=FOUR
*BEAM SECTION,SECTION=I, TEMPERATURE=VALUES,MATERIAL=A1, ELSET=EALL
2., 2., 2., 2., .2, 0., .2
0., 0., -1.
*MATERIAL,NAME=A1
*ELASTIC
 3.E6, 0.3
*BOUNDARY
1, 1, 7
*STEP,PERTURBATION
*STATIC
*CLOAD
11,2,25.
*EL PRINT
SF,
*NODE PRINT
U,
COORD,
*END STEP
*STEP,PERTURBATION
*STATIC
*CLOAD
11,4,25.
*END STEP