*HEADING
Test of angular acceleration loading on B21 elements.
*NODE,NSET=NALL
*ELEMENT,TYPE=B21,ELSET=EALL
*BEAM SECTION,SECTION=RECT,ELSET=EALL,MATERIAL=STEEL
1.,1.
*MATERIAL,NAME=STEEL
*ELASTIC
30.E6,.33
*DENSITY
200.,
*BOUNDARY
NALL,1,6
*STEP
*STATIC
*DLOAD
EALL,ROTA,10.,0.,0.,0.,0,0,1
*NODE PRINT,TOTALS=YES
RF,
*EL PRINT
EVOL,
*END STEP