*HEADING
PLATE WITH HOLD:CPE4R; automatic time inc with time points;
cyclic concentrated loading with varying Fourier terms
*restart,write,freq=25
*NODE
*NGEN,LINE=C
*NGEN
*NSET,NSET=DOWN,GENERATE
*NSET,NSET=UP,GENERATE
*NFILL,BIAS=0.75
DOWN,UP,8,200
*NSET,NSET=TOP,GENERATE
*NSET,NSET=BOTTOM,GENERATE
*NSET,NSET=LEFT,GENERATE
*NSET,NSET=RMPC,GENERATE
*NSET,NSET=ONE
*nset,nset=nall,generate
*ELEMENT,TYPE=CPE4R
*ELGEN,ELSET=ALLE
*ELSET,ELSET=TOPE,GENERATE
*ELSET,ELSET=LEFTE
*ELSET,ELSET=TIP
*ELSET,ELSET=RIGHTE,GENERATE
*BOUNDARY
BOTTOM,2
TOP,2
LEFT,1
*MATERIAL,NAME=BIDERMAN
*ELASTIC
70000, .33
*PLASTIC, HARDENING=KINEMATIC
62,0
595.5,1
*VISCOUS,LAW=STRAIN
*SOLID SECTION,MATERIAL=BIDERMAN,ELSET=ALLE
1.5,
*AMPLITUDE,NAME=AMP
0,0,10,1,30,0
*STEP,inc=500
*DIRECT CYCLIC,CETOL=1.0E-4
*TIME POINTS,GENERATE
0,30,0.25
*CONTROLS,TYPE=DIRECT CYCLIC
,,,5E-2,1E-3
*CLOAD,AMP=AMP
RMPC,1,100
*OUTPUT,HISTORY,FREQ=1
*node output,nset=one
u
cf
*element output,elset=tip
s
e
pe
ve
*END STEP