*HEADING
cube: C3D10; fixed time inc with time points; cyclic cload
and varying Fourier terms
*NODE,NSET=NOEUDS
*ELEMENT,TYPE=C3D10   ,ELSET=ELTS
*NSET,NSET=NDBAS
*NSET,NSET=NFORCE
**
**************************************
**************************************
**
*SOLID SECTION,ELSET=ELTS,MATERIAL=PLAS
**
*MATERIAL,NAME=PLAS
*ELASTIC
60000.0 , 0.33
*PLASTIC,HARDENING=KINEMATIC
  62   ,  0  ,   20
 382.1 , .1  ,   20
  45   ,  0  ,  100
 305.1 , .1  ,  100
  32   ,  0  ,  150
 202.1 , .1  ,  150
  28   ,  0  ,  200
 163   , .1  ,  200
**
**************************************
**************************************
**
*elset,elset=e1
*nset,nset=n12
*AMPLITUDE,NAME=AMP
0,0 , 10,1 ,30,-1 , 40,0
**
**************************************
**************************************
**
*STEP,INC=500
*DIRECT CYCLIC
*TIME POINTS,GENERATE
0,40,0.5
*BOUNDARY
NDBAS, 3, 3, 0
23    , 1, 2, 0
8     , 1, 1, 0
10    , 1, 1, 0
31    , 2, 2, 0
33    , 2, 2, 0
*CLOAD,AMPLITUDE=AMP
12, 3, 40
NFORCE, 3, 20
*print,freq=20
*OUTPUT,history,FREQ=1
*element output,elset=e1
s
e
ee
pe
*node output,nset=n12
CF
U
*node print,nset=n12
CF
U
*END STEP