*Heading
** Job name: damage_section_no Model name: damage_section_no
*Preprint, echo=NO, model=yes, history=NO, contact=NO
**
** PARTS
**
*Part, name=PART-1
*Node
*Element, type=T2D2
*Element, type=T3D2
*Element, type=C3D8R
*Element, type=CPE4R
*Element, type=CAX4R
*Elset, elset=EALL, generate
** Region: (Section-1-EALL:EALL)
** Section: Section-1-EALL
*Solid Section, elset=EALL, material=MAT_JC,controls=cont
1.,
*End Part
**
**
** ASSEMBLY
**
*Assembly, name=Assembly
**
*Instance, name=PART-1-1, part=PART-1
*End Instance
**
*Nset, nset=CONTINUUM_ALL, instance=PART-1-1, generate
*Nset, nset=CONTINUUM_BACK, instance=PART-1-1, generate
*Nset, nset=CONTINUUM_BOTTOM, instance=PART-1-1
*Nset, nset=CONTINUUM_FRONT, instance=PART-1-1, generate
*Nset, nset=CONTINUUM_LEFT, instance=PART-1-1
*Nset, nset=CONTINUUM_RIGHT, instance=PART-1-1
*Nset, nset=CONTINUUM_TOP, instance=PART-1-1
*Nset, nset=NALL, instance=PART-1-1, generate
*Nset, nset=PLANE_ALL, instance=PART-1-1, generate
*Nset, nset=PLANE_BOTTOM, instance=PART-1-1
*Nset, nset=PLANE_LEFT, instance=PART-1-1
*Nset, nset=PLANE_RIGHT, instance=PART-1-1
*Nset, nset=PLANE_TOP, instance=PART-1-1
*Nset, nset=TRUSS_ALL, instance=PART-1-1, generate
*Nset, nset=TRUSS_BOTTOM, instance=PART-1-1
*Nset, nset=TRUSS_TOP, instance=PART-1-1
*Elset, elset=QA_TEST_ALLELEMENTS, instance=PART-1-1, generate
*Elset, elset=SOLID, instance=PART-1-1, generate
*End Assembly
*Amplitude, name=AMP1, definition=SMOOTH STEP
0., 0., 0.5, 1.
*Amplitude, name=AMP2, definition=SMOOTH STEP
0., 1., 0.5, -1.
**
** MATERIALS
**
*SECTION CONTROLS,NAME=CONT,ELEMENT DELETION=NO,MAX DEGRADATION=0.8
*Material, name=MAT_JC
*Density
8960.,
*Elastic
 1.24e+11, 0.34
*Plastic, hardening=JOHNSON COOK
 9e+07, 2.92e+08,     0.31,     1.09,    1083.,      25.
*DAMAGE INITIATION,CRITERION=DUCTILE
2E-3
*DAMAGE EVOLUTION,TYPE=ENERGY,SOFTENING=EXPONENTIAL
5E4
**
** BOUNDARY CONDITIONS
**
** Name: Disp-BC-1 Type: Displacement/Rotation
*Boundary
TRUSS_BOTTOM, 2, 2
** Name: Disp-BC-2 Type: Displacement/Rotation
*Boundary
TRUSS_ALL, 1, 1
** Name: Disp-BC-3 Type: Displacement/Rotation
*Boundary
TRUSS_ALL, 3, 3
** Name: Disp-BC-4 Type: Displacement/Rotation
*Boundary
CONTINUUM_BOTTOM, 2, 2
** Name: Disp-BC-5 Type: Displacement/Rotation
*Boundary
CONTINUUM_LEFT, 1, 1
** Name: Disp-BC-6 Type: Displacement/Rotation
*Boundary
CONTINUUM_ALL, 3, 3
** Name: Disp-BC-7 Type: Displacement/Rotation
*Boundary
PLANE_BOTTOM, 2, 2
** Name: Disp-BC-8 Type: Displacement/Rotation
*Boundary
PLANE_LEFT, 1, 1
** Name: Disp-BC-9 Type: Displacement/Rotation
*Boundary
PLANE_ALL, 3, 3
** ----------------------------------------------------------------
**
** STEP: Step-1
**
*Step, name=Step-1
*Dynamic, Explicit
, 0.5
*Bulk Viscosity
**
** BOUNDARY CONDITIONS
**
** Name: Disp-BC-10 Type: Displacement/Rotation
*Boundary, amplitude=AMP1
TRUSS_TOP, 2, 2, -0.02
** Name: Disp-BC-11 Type: Displacement/Rotation
*Boundary, amplitude=AMP1
CONTINUUM_RIGHT, 1, 1, -0.04
** Name: Disp-BC-12 Type: Displacement/Rotation
*Boundary, amplitude=AMP1
CONTINUUM_TOP, 2, 2
** Name: Disp-BC-13 Type: Displacement/Rotation
*Boundary, amplitude=AMP1
PLANE_RIGHT, 1, 1, -0.04
** Name: Disp-BC-14 Type: Displacement/Rotation
*Boundary, amplitude=AMP1
PLANE_TOP, 2, 2
**
** OUTPUT REQUESTS
**
*Restart, write, number interval=10, time marks=NO
**
** FIELD OUTPUT: F-Output-2
**
*Output, field, time marks=YES,number interval=20
*Node Output, nset=NALL
U,
**
** FIELD OUTPUT: F-Output-1
**
*Element Output, elset=QA_TEST_ALLELEMENTS
STATUS,SDEG,DMICRT
PEEQ,S
**
** HISTORY OUTPUT: H-Output-1
**
*Output, history, time interval=0.001
*Element Output, elset=PART-1-1.EALL
STATUS,SDEG,DMICRT
PEEQ,LEP,SP,MISES,PRESS,LE,S
**
** HISTORY OUTPUT: H-Output-2
**
*Output, history, variable=PRESELECT, time interval=0.25
*End Step
** ----------------------------------------------------------------
**
** STEP: Step-2
**
*Step, name=Step-2
*Dynamic, Explicit
, 0.5
*Bulk Viscosity
**
** BOUNDARY CONDITIONS
**
** Name: Disp-BC-1 Type: Displacement/Rotation
*Boundary, op=NEW
TRUSS_BOTTOM, 2, 2
** Name: Disp-BC-10 Type: Displacement/Rotation
*Boundary, op=NEW
** Name: Disp-BC-11 Type: Displacement/Rotation
*Boundary, op=NEW
** Name: Disp-BC-12 Type: Displacement/Rotation
*Boundary, op=NEW
** Name: Disp-BC-13 Type: Displacement/Rotation
*Boundary, op=NEW
** Name: Disp-BC-14 Type: Displacement/Rotation
*Boundary, op=NEW
** Name: Disp-BC-15 Type: Displacement/Rotation
*Boundary, op=NEW, amplitude=AMP2
TRUSS_TOP, 2, 2, -0.02
** Name: Disp-BC-16 Type: Displacement/Rotation
*Boundary, op=NEW, amplitude=AMP2
CONTINUUM_RIGHT, 1, 1, -0.04
** Name: Disp-BC-17 Type: Displacement/Rotation
*Boundary, op=NEW, amplitude=AMP2
CONTINUUM_TOP, 2, 2
** Name: Disp-BC-18 Type: Displacement/Rotation
*Boundary, op=NEW, amplitude=AMP2
PLANE_RIGHT, 1, 1, -0.04
** Name: Disp-BC-19 Type: Displacement/Rotation
*Boundary, op=NEW, amplitude=AMP2
PLANE_TOP, 2, 2
** Name: Disp-BC-2 Type: Displacement/Rotation
*Boundary, op=NEW
TRUSS_ALL, 1, 1
** Name: Disp-BC-3 Type: Displacement/Rotation
*Boundary, op=NEW
TRUSS_ALL, 3, 3
** Name: Disp-BC-4 Type: Displacement/Rotation
*Boundary, op=NEW
CONTINUUM_BOTTOM, 2, 2
** Name: Disp-BC-5 Type: Displacement/Rotation
*Boundary, op=NEW
CONTINUUM_LEFT, 1, 1
** Name: Disp-BC-6 Type: Displacement/Rotation
*Boundary, op=NEW
CONTINUUM_ALL, 3, 3
** Name: Disp-BC-7 Type: Displacement/Rotation
*Boundary, op=NEW
PLANE_BOTTOM, 2, 2
** Name: Disp-BC-8 Type: Displacement/Rotation
*Boundary, op=NEW
PLANE_LEFT, 1, 1
** Name: Disp-BC-9 Type: Displacement/Rotation
*Boundary, op=NEW
PLANE_ALL, 3, 3
*End Step