*HEADING
 m-k criterion with mises plasticity
*RESTART,WRITE,NUMBER INTERVAL=10
*PREPRINT,MODEL=YES
*NODE,NSET=NALL
*******CONTINUUM SHELL**********
*ELEMENT,TYPE=SC8R,ELSET=SHELL
*NSET,NSET=CONTINUUM_BOTTOM
*NSET,NSET=CONTINUUM_TOP
*NSET,NSET=CONTINUUM_LEFT
*NSET,NSET=CONTINUUM_RIGHT
*NSET,NSET=CONTINUUM_BACK
*NSET,NSET=CONTINUUM_FRONT
*NSET,NSET=CONTINUUM_ALL
CONTINUUM_BOTTOM,CONTINUUM_TOP,CONTINUUM_LEFT,CONTINUUM_RIGHT
CONTINUUM_BACK,CONTINUUM_FRONT
*******SHELL*****************
*ELEMENT,TYPE=S4R,ELSET=SHELL
*ELEMENT,TYPE=S4RS,ELSET=SHELL
*NSET,NSET=SHELL_BOTTOM
*NSET,NSET=SHELL_TOP
*NSET,NSET=SHELL_LEFT
*NSET,NSET=SHELL_RIGHT
*NSET,NSET=SHELL_ALL
SHELL_BOTTOM,SHELL_TOP,SHELL_LEFT,SHELL_RIGHT
************CPS4R AND MEMBRANE***************
*ELEMENT,TYPE=CPS4R,ELSET=SOLID
*ELEMENT,TYPE=M3D4R,ELSET=MEMBRANE
*ELEMENT,TYPE=M3D4,ELSET=MEMBRANE
*NSET,NSET=PLANE_BOTTOM
*NSET,NSET=PLANE_LEFT
*NSET,NSET=PLANE_TOP
*NSET,NSET=MEMBRANE_TOP
*NSET,NSET=PLANE_RIGHT
*NSET,NSET=MEMBRANE_RIGHT
*NSET,NSET=PLANE_ALL
PLANE_BOTTOM,PLANE_TOP,PLANE_LEFT,PLANE_RIGHT,
MEMBRANE_RIGHT,MEMBRANE_TOP
***************BOUNDARY************************
*BOUNDARY
CONTINUUM_BOTTOM,2,2
CONTINUUM_LEFT,1,1
CONTINUUM_ALL,3,3
SHELL_BOTTOM,2,2
SHELL_LEFT,1,1
SHELL_ALL,3,6
PLANE_BOTTOM,2,2
PLANE_LEFT,1,1
PLANE_ALL,3,3
***************************************
*SHELL SECTION,MATERIAL=MAT_MISES,ELSET=SHELL,CONTROLS=CONT
0.1
*SOLID SECTION,MATERIAL=MAT_MISES,ELSET=SOLID,CONTROLS=CONT
1.0
*MEMBRANE SECTION,MATERIAL=MAT_MISES,ELSET=MEMBRANE,CONTROLS=CONT
0.1
*SECTION CONTROLS,ELEMENT DELETION=YES,MAX DEGRADATION=0.75,NAME=CONT
*ELSET,ELSET=EALL
SOLID,SHELL,MEMBRANE
*ELSET,ELSET=QA_TEST_ALLELEMENTS
EALL
***************************************
*MATERIAL,NAME=MAT_MISES
*Density
7800
*Elastic
2.10E+011,	0.3
*Plastic, Hardening=Isotropic, Rate=0
7.76E+08,	0,
8.09E+08,	0.01,
8.29E+08,	2.00E-02,
8.42E+08,	3.00E-02,
8.66E+08,	6.00E-02,
8.83E+08,	1.00E-01,
8.95E+08,	1.50E-01,
9.10E+08,	2.50E-01,
*Plastic, Hardening=Isotropic,Rate=0.001
7.91E+08,	0.00E+00,
8.24E+08,	1.00E-02,
8.46E+08,	2.00E-02,
8.63E+08,	3.00E-02,
8.99E+08,	6.00E-02,
9.31E+08,	1.00E-01,
9.58E+08,	1.50E-01,
9.95E+08,	2.50E-01,
*Plastic, Hardening=Isotropic, Rate=0.01
7.99E+08,	0.00E+00,
8.31E+08,	1.00E-02,
8.55E+08,	2.00E-02,
8.74E+08,	3.00E-02,
9.16E+08,	6.00E-02,
9.55E+08,	1.00E-01,
9.89E+08,	1.50E-01,
1.04E+09,	2.50E-01,
*Plastic, Hardening=Isotropic, Rate=0.1
8.05E+08,	0.00E+00,
8.38E+08,	1.00E-02,
8.63E+08,	2.00E-02,
8.84E+08,	3.00E-02,
9.33E+08,	6.00E-02,
9.78E+08,	1.00E-01,
1.02E+09,	1.50E-01,
1.08E+09,	2.50E-01,
*Plastic, Hardening=Isotropic, Rate=1.
8.08E+08,	0.00E+00,
8.42E+08,	1.00E-02,
8.69E+08,	2.00E-02,
8.93E+08,	3.00E-02,
9.46E+08,	6.00E-02,
9.98E+08,	1.00E-01,
1.05E+09,	1.50E-01,
1.12E+09,	2.50E-01,
*Plastic, Hardening=Isotropic, Rate=10.
8.10E+08,	0.00E+00,
8.46E+08,	1.00E-02,
8.76E+08,	2.00E-02,
9.01E+08,	3.00E-02,
9.60E+08,	6.00E-02,
1.02E+09,	1.00E-01,
1.07E+09,	1.50E-01,
1.15E+09,	2.50E-01,
*Plastic, Hardening=Isotropic, Rate=100.
8.12E+08,	0.00E+00,
8.50E+08,	1.00E-02,
8.82E+08,	2.00E-02,
9.09E+08,	3.00E-02,
9.74E+08,	6.00E-02,
1.04E+09,	1.00E-01,
1.10E+09,	1.50E-01,
1.19E+09,	2.50E-01,
*Plastic, Hardening=Isotropic, Rate=1000.
8.15E+08,	0.00E+00,
8.55E+08,	1.00E-02,
8.88E+08,	2.00E-02,
9.17E+08,	3.00E-02,
9.87E+08,	6.00E-02,
1.06E+09,	1.00E-01,
1.13E+09,	1.50E-01,
1.23E+09,	2.50E-01,
*DAMAGE INITIATION, CRITERION=MK, FNN = 10.0, FNT= 10.0, FEQ= 10.0, NUMBER IMPERFECTION=100
 0.99, 0.0
 0.98,45.0
 0.97,90.0
 0.98,135.0
*DAMAGE EVOLUTION,TYPE=ENERGY,SOFTENING=EXPONENTIAL
1E9
*AMPLITUDE,NAME=AMP1,DEFINITION=DECAY
-1,1,0,-0.05
*STEP
*DYNAMIC,EXPLICIT
,0.05
*BOUNDARY,TYPE=DISPLACEMENT,AMP=AMP1
CONTINUUM_TOP,2,2,1
CONTINUUM_RIGHT,1,1,1
SHELL_TOP,2,2,1
SHELL_RIGHT,1,1,1
PLANE_TOP,2,2,1
PLANE_RIGHT,1,1,1
MEMBRANE_TOP,2,2,2
MEMBRANE_RIGHT,1,1,2
**
*OUTPUT,FIELD,NUMBER INTERVAL=20,TIME MARKS=YES
*ELEMENT OUTPUT,ELSET=QA_TEST_ALLELEMENTS
STATUS,SDEG,DMICRT
PEEQ,S
*NODE OUTPUT,NSET=NALL
U,
*OUTPUT,HISTORY,TIME INTERVAL=0.0001
*ELEMENT OUTPUT,ELSET=EALL
STATUS,SDEG,DMICRT
PEEQ,LEP,SP,MISES,PRESS
*OUTPUT,HISTORY,VARIABLE=PRESELECTED,TIME INTERVAL=0.025
*END STEP