*HEADING
 flsd criterion with hill plasticity
*RESTART,WRITE,NUMBER INTERVAL=10
*PREPRINT,MODEL=YES
*NODE,NSET=NALL
*******CONTINUUM SHELL**********
*ELEMENT,TYPE=SC8R,ELSET=SHELL
*NSET,NSET=CONTINUUM_BOTTOM
*NSET,NSET=CONTINUUM_TOP
*NSET,NSET=CONTINUUM_LEFT
*NSET,NSET=CONTINUUM_RIGHT
*NSET,NSET=CONTINUUM_BACK
*NSET,NSET=CONTINUUM_FRONT
*NSET,NSET=CONTINUUM_ALL
CONTINUUM_BOTTOM,CONTINUUM_TOP,CONTINUUM_LEFT,CONTINUUM_RIGHT
CONTINUUM_BACK,CONTINUUM_FRONT
*******SHELL*****************
*ELEMENT,TYPE=S4R,ELSET=SHELL
*ELEMENT,TYPE=S4RS,ELSET=SHELL
*NSET,NSET=SHELL_BOTTOM
*NSET,NSET=SHELL_TOP
*NSET,NSET=SHELL_LEFT
*NSET,NSET=SHELL_RIGHT
*NSET,NSET=SHELL_ALL
SHELL_BOTTOM,SHELL_TOP,SHELL_LEFT,SHELL_RIGHT
************CPS4R AND MEMBRANE***************
*ELEMENT,TYPE=CPS4R,ELSET=SOLID
*ELEMENT,TYPE=M3D4R,ELSET=MEMBRANE
*ELEMENT,TYPE=M3D4,ELSET=MEMBRANE
*NSET,NSET=PLANE_BOTTOM
*NSET,NSET=PLANE_LEFT
*NSET,NSET=PLANE_TOP
*NSET,NSET=MEMBRANE_TOP
*NSET,NSET=PLANE_RIGHT
*NSET,NSET=MEMBRANE_RIGHT
*NSET,NSET=PLANE_ALL
PLANE_BOTTOM,PLANE_TOP,PLANE_LEFT,PLANE_RIGHT,
MEMBRANE_RIGHT,MEMBRANE_TOP
***************BOUNDARY************************
*BOUNDARY
CONTINUUM_BOTTOM,2,2
CONTINUUM_LEFT,1,1
CONTINUUM_ALL,3,3
SHELL_BOTTOM,2,2
SHELL_LEFT,1,1
SHELL_ALL,3,6
PLANE_BOTTOM,2,2
PLANE_LEFT,1,1
PLANE_ALL,3,3
***************************************
*ORIENTATION,NAME=RECT
*SHELL SECTION,MATERIAL=MAT_HILL,ELSET=SHELL,CONTROLS=CONT,ORIENT=RECT
0.1
*SOLID SECTION,MATERIAL=MAT_HILL,ELSET=SOLID,CONTROLS=CONT,ORIENT=RECT
1.0
*MEMBRANE SECTION,MATERIAL=MAT_HILL,ELSET=MEMBRANE,CONTROLS=CONT,ORIENT=RECT
0.1
*SECTION CONTROLS,ELEMENT DELETION=YES,MAX DEGRADATION=0.75,NAME=CONT
*ELSET,ELSET=EALL
SOLID,SHELL,MEMBRANE
*ELSET,ELSET=QA_TEST_ALLELEMENTS
EALL
***************************************
*MATERIAL,NAME=MAT_HILL
*DENSITY
8.96E3
*ELASTIC
124.E9,0.34
**PLASTIC,HARDENING=JOHNSON COOK
**90.E6,292E6,0.31,1.09,1083,25
*PLASTIC,HARDENING=ISOTROPIC
  90.0000E6,   0.0000
 142.7256E6,   0.0040
 155.3643E6,   0.0080
 164.1189E6,   0.0120
 171.0327E6,   0.0160
 176.8365E6,   0.0200
 187.4375E6,   0.0290
 195.9536E6,   0.0380
*POTENTIAL
*DAMAGE INITIATION,CRITERION=FLSD
100E6
*DAMAGE EVOLUTION,TYPE=ENERGY,SOFTENING=LINEAR
1E6
*AMPLITUDE,NAME=AMP1,DEFINITION=SMOOTH STEP
0,0,0.5,0.1
*STEP
*DYNAMIC,EXPLICIT
,0.5
*BOUNDARY,TYPE=DISPLACEMENT,AMP=AMP1
CONTINUUM_TOP,2,2,1
CONTINUUM_RIGHT,1,1,1
SHELL_TOP,2,2,1
SHELL_RIGHT,1,1,1
PLANE_TOP,2,2,1
PLANE_RIGHT,1,1,1
MEMBRANE_TOP,2,2,2
MEMBRANE_RIGHT,1,1,2
**
**
*OUTPUT,FIELD,NUMBER INTERVAL=15,TIME MARKS=YES
*ELEMENT OUTPUT,ELSET=QA_TEST_ALLELEMENTS
STATUS,SDEG,DMICRT
PEEQ,S
*NODE OUTPUT,NSET=NALL
U,
*OUTPUT,HISTORY,TIME INTERVAL=0.001
*ELEMENT OUTPUT,ELSET=EALL
STATUS,SDEG,DMICRT
PEEQ,LEP,SP,MISES,PRESS
*OUTPUT,HISTORY,VARIABLE=PRESELECTED,TIME INTERVAL=0.25
*END STEP