*Heading
**
**Crimp Forming with General Contact
**
*Preprint, model=YES, history=YES
**
** PARTS
**
*Part, name=CRIMP_REDU_PART-1
*End Part
*Part, name=CRIMP_REDU_PART-10-1
*End Part
*Part, name=CRIMP_REDU_PART-11-1
*End Part
*Part, name=CRIMP_REDU_PART-12-1
*End Part
*Part, name=CRIMP_REDU_PART-13-1
*End Part
*Part, name=CRIMP_REDU_PART-14-1
*End Part
*Part, name=CRIMP_REDU_PART-16-1
*End Part
*Part, name=CRIMP_REDU_PART-17-1
*End Part
*Part, name=CRIMP_REDU_PART-18-1
*End Part
*Part, name=CRIMP_REDU_PART-19-1
*End Part
*Part, name=CRIMP_REDU_PART-2-1
*End Part
*Part, name=CRIMP_REDU_PART-20-1
*End Part
*Part, name=CRIMP_REDU_PART-21-1
*End Part
*Part, name=CRIMP_REDU_PART-22-1
*End Part
*Part, name=CRIMP_REDU_PART-3-1
*End Part
*Part, name=CRIMP_REDU_PART-4-1
*End Part
*Part, name=CRIMP_REDU_PART-5-1
*End Part
*Part, name=CRIMP_REDU_PART-6-1
*End Part
*Part, name=CRIMP_REDU_PART-7-1
*End Part
*Part, name=CRIMP_REDU_PART-8-1
*End Part
*Part, name=CRIMP_REDU_PART-9-1
*End Part
*Part, name=rigid_top
*End Part
**
*Include, Input=crimp_assembly.inp
**
** SECTION CONTROLS
**
*SECTION CONTROLS, Name=Sect1,
HOURGLASS=STIFFNESS
**
*Amplitude, name=PUNCH_DOWN_DISP,
definition=SMOOTH STEP, value=ABSOLUTE
0.,0.,0.018,-0.9,0.030833,-4.75,0.090833,-6.25,
0.122333, -6.88
**Displacement BC has the following avg.speeds:
**Average Speed 1 = 50 mm/sec
**Average Speed 2 = 300 mm/sec
**Average Speed 3 = 25 mm/sec
**Average Speed 4 = 20 mm/sec
**
** MATERIALS
**
*Material, name=COPPER_WIRE
*Density
 0.0085,
*Elastic
117000., 0.35
*Plastic
 241.5,      0.
 268.2, 0.00075
  282., 0.00164
 287.5,  0.0026
 290.3,   0.017
 4100.,     20.
*Material, name=GRIP_MATERIAL
*Density
 0.0085,
*Elastic
112000., 0.34
*Plastic
  391.,      0.
  418., 0.00075
 431.5, 0.00164
  437.,  0.0026
  440.,   0.017
 4270.,     20.
**
** INTERACTION PROPERTIES
**
*Surface Interaction, name="GLOBAL PROPERTY"
*Friction
0.,
*Surface Interaction, name=GRIP_BOT_RIGID
*Friction, taumax=300.
 0.3,
*Surface Interaction, name=GRIP_TOP_RIGID
*Friction, taumax=300.
 0.15,
*Surface Interaction, name=WIRES
*Friction
 0.15,
**
** BOUNDARY CONDITIONS
**
*Boundary
_G85, ENCASTRE
**
*Boundary
WIRES_END, PINNED
*Boundary
TOP_RIGID_REFNODE, 1,1, 0.0
TOP_RIGID_REFNODE, 3,6, 0.0
** ---------------------------------
**
** STEP: Step-1
**
*Step, name=Step-1
PUNCHDOWN
*Dynamic, Explicit
 ,0.122333
*Bulk Viscosity
**
** BOUNDARY CONDITIONS
**
*Boundary, amplitude=PUNCH_DOWN_DISP
TOP_RIGID_REFNODE, 2, 2
**
** INTERACTIONS
**
** Interaction: General Contact
*Contact, op=NEW
*Contact Inclusions, ALL ELEMENT BASED
*Contact property assignment
 ,  , "GLOBAL PROPERTY"
WIRES_EXT_SURF ,  , WIRES
BOT_RIGID_SURF , GRIP_EXT_SURF , GRIP_BOT_RIGID
Top_Rigid_surf , GRIP_EXT_SURF , GRIP_TOP_RIGID
GRIP_EXT_SURF ,  , GRIP_BOT_RIGID
*Surface Property Assignment,
PROPERTY=FEATURE EDGE CRITERIA
**
** OUTPUT REQUESTS
**
*Restart, write, number interval=1, time marks=NO
*Monitor, dof=2, node=REFNODE_MONITOR
**
** FIELD OUTPUT: F-Output-1
**
*Output, field, variable=PRESELECT,
number interval=50
**
** HISTORY OUTPUT: H-Output-1
**
*Output, history, variable=PRESELECT,
time interval=0.000970065
**
** HISTORY OUTPUT: H-Output-2
**
*Output, history, time interval=0.000970065
*Node Output, nset=TOP_RIGID_REFNODE
U2, RF2
*End Step