*HEADING
THERMALLY COUPLED CONTACT, FINITE SLIDING CONTACT WITH
INTERFACE CONDUCTIVITY, DEFORMABLE [CPE6MT]
**
** See ch. 1.6.7 of ABAQUS/Verification Manual
**
*NODE,NSET=ALL
***
**
**
**
*NGEN,NSET=ALL
*NSET,NSET=QA_TEST
ALL
*NSET,NSET=BOT,GEN
*NSET,NSET=TOP,GEN
**
*ELEMENT,TYPE=CPE6MT,ELSET=DEAD
*SOLID SECTION,ELSET=DEAD,MATERIAL=DEAD
*MATERIAL,NAME=DEAD
*ELASTIC
30.E6,.3
*CONDUCTIVITY
10.000,
*SPECIFIC HEAT
0.001,
*DENSITY
1000.,
**
*ELEMENT,TYPE=CPE6MT,ELSET=ACTIVE
***
*ELSET,ELSET=ETOP
*ELSET,ELSET=EBOT, GENERATE
*SOLID SECTION,ELSET=ACTIVE,MATERIAL=ACTIVE
*MATERIAL,NAME=ACTIVE
*ELASTIC
30.E6,.3
*CONDUCTIVITY
10.,
*DENSITY
1000.,
*SPECIFIC HEAT
.001,
**
*AMPLITUDE, NAME=SLIDE, VALUE=RELATIVE, TIME=STEP,DEFINITION=SMOOTH STEP
0.0, 0.0,  20., 1.0,  40., 0.0,  60., -1.0
80., 0.0,  100., 0.0
*AMPLITUDE, NAME=RAMP, DEFINITION=SMOOTH STEP
0.0,0.0,10.,1.0
**
*INITIAL CONDITIONS,TYPE=TEMP
ALL,20.0
**
*ELSET,ELSET=EALL
ACTIVE,DEAD
**
*SURFACE, NAME=ASURF
ETOP,S1
*SURFACE, NAME=BSURF
EBOT,S2
**
*STEP
STEP 1
*DYNAMIC TEMPERATURE-DISPLACEMENT, EXPLICIT, DIRECT
**
*CONTACT PAIR,INTERACTION=ROUGH,WEIGHT=0.0
ASURF,BSURF
*SURFACE INTERACTION,NAME=ROUGH
*GAP CONDUCTANCE,PRESSURE
*GAP HEAT GENERATION
**
*BOUNDARY, TYPE=VELOCITY
BOT,2,2
1,1,1
7,1,1
123,1,1
*DLOAD,AMP=RAMP
102,P2,100.
104,P2,100.
*DFLUX,AMP=RAMP
102,S2,100.
104,S2,100.
*FILM,AMP=RAMP
3,F1,20.,10.
*********************
*FILE OUTPUT,N=1
*NODE FILE,NSET=ALL
NT,
********************
*OUTPUT,FIELD,NUM=1
*NODE OUTPUT,NSET=QA_TEST
NT,
*NODE OUTPUT,NSET=ALL
U,
************
*CONTACT OUTPUT
CSTRESS,
*ELEMENT OUTPUT
S,
********************
***OUTPUT,HISTORY, FREQUENCY=500
***NODE OUTPUT,NSET=ALL
**U,NT
*******************
*OUTPUT,HISTORY, FREQUENCY=99999
*ENERGY OUTPUT,VAR=ALL
******************
*END STEP
**
*STEP
STEP 2
*DYNAMIC TEMPERATURE-DISPLACEMENT, EXPLICIT, DIRECT
*BOUNDARY, TYPE=VELOCITY
TOP,2,2
*BOUNDARY,AMPLITUDE=SLIDE
123,1,1,1.5
*END STEP
**
*STEP
STEP 3 RUN TO STEADY STATE
*DYNAMIC TEMPERATURE-DISPLACEMENT, EXPLICIT, DIRECT
*BOUNDARY,OP=NEW, TYPE=VELOCITY
BOT,2,2
1,1,1
7,1,1
123,1,1
*END STEP
**
*STEP
STEP 4 RUN TO STEADY STATE
*DYNAMIC TEMPERATURE-DISPLACEMENT, EXPLICIT, DIRECT
*AMPLITUDE,NAME=RAMP2, DEFINITION=SMOOTH STEP
0.0,0.5,10.0,1.0
*DLOAD,AMP=RAMP2
102,P2,200.
104,P2,200.
*END STEP
**
*STEP
STEP 5
*DYNAMIC TEMPERATURE-DISPLACEMENT, EXPLICIT, DIRECT
*AMPLITUDE, NAME=REMOVE, VALUE=RELATIVE, TIME=STEP, DEFINITION=SMOOTH STEP
0.0, 1.0,  30.0, 0.0,  40.0, 0.0
*DFLUX, AMP=REMOVE
102, S2, 100.0
104, S2, 100.0
*BOUNDARY,TYPE=VELOCITY
123, 1,1, 0.1
121,2,2
122,2,2
123,2,2
124,2,2
125,2,2
*END STEP